Zephyr Weekly Build CI Dashboard

Repository zephyrproject-rtos/zephyr  |  workflow twister.yaml (schedule)  |  Zephyr v4.5.0-rc2-76-ga915b2f12675
Run started 2026-10-18 02:09 UTC  |  report generated 2026-10-18 18:15 UTC

1,044,176
Test Instances
764,907
Built
160
Build Failures
99.98%
Build Success Rate
105
Platforms Failing
63
Tests Failing
1,727
Platforms Covered
4,985
Distinct Tests
13h 20m
Run Wall Time
23,783h
Build CPU Time
45/203
CI Jobs Failed

Run Details

Workflow
twister.yaml #312916 (run 39089067102, attempt 1)
Conclusion
failure
Triggered by
schedule on main
Commit
a915b2f12675 — Run tests with twister
Zephyr version
v4.5.0-rc2-76-ga915b2f12675
Toolchain
zephyr/gnu
Commit date
2026-10-16 20:53 UTC
Twister run date
2026-10-18 02:12 UTC
CI started
2026-10-18 02:09 UTC
CI finished
2026-10-18 15:30 UTC
Wall time
13h 20m
CI jobs
success 158 failure 45
Result artifacts
198 parsed, 198 twister subsets
Twister options
build only: True, all platforms: True, report filtered: True, retries: 2, timeout x: 2.0, config: tests/test_config_ci.yaml, jobs/runner: 32

Result Breakdown

error — 160 (0.02%)skipped — 16,763 (1.61%)filtered — 262,506 (25.14%)not run — 764,747 (73.24%)

This is a build-only run of the whole tree, so most instances end as not run (built, never executed) or filtered (not applicable to the platform). Build failures are the error and failed rows.

StatusInstancesShareTest casesMeaning
passed00.00%0Built and executed successfully.
failed00.00%0Built, executed, and produced unexpected results.
error1600.02%1,049Failed to build, or errored before producing a result.
skipped16,7631.61%224,094Explicitly skipped (unmet precondition).
filtered262,50625.14%1,535,337Not applicable to this platform; never built.
not run764,74773.24%8,599,125Built successfully but not executed (build-only run).

Trend Across Weekly Runs

One point per saved run. Toggle series below; volume metrics start hidden because they dwarf the failure counts.

Run dateZephyrSuites builtFailuresPlatforms failingTests failingBuilt, not runCI jobs failedWall time (min)
2026-10-18 02:09v4.5.0-rc2-76-ga915b2f12675764,907160▼ 55105▲ 163▼ 27764,74745▼ 12800▼ 18
2026-10-11 02:19v4.5.0-rc1-483-g920074c07cf4774,399215▼ 7104▼ 290▼ 7774,18457 =818▲ 32
2026-10-04 02:43v4.5.0-rc1-158-g894020886d64774,806222▼ 326106▼ 5397▼ 64774,58457▼ 41787▲ 50
2026-09-27 02:13v4.4.0-17307-g6f1ab6c070f2742,354548▼ 624159▼ 188161▼ 11741,80698 =737▲ 8
2026-09-20 02:09v4.4.0-16104-g64437be51c30737,3971,172▲ 505347▲ 89172▼ 51736,22598▼ 9729▼ 33
2026-09-13 02:09v4.4.0-15130-ge5d4c2cd3330731,929667258223731,262107762

Platforms With Failures

105 of 1,727 platforms had at least one build failure. Click a header to sort, type in a box to filter.

PlatformArchFailuresErrorFailedBuiltFailure rate
beaglebadge/am62l3/a53arm6414140395
3.5%
mps4/corstone315/fvp/nsarm9909
100.0%
mps4/corstone320/fvp/nsarm9909
100.0%
rock_5b_plus/rk3588/smparm64660397
1.5%
mr_mcxn_t1/mcxn947/cpu1arm440364
1.1%
nrf9280pdk@0.2.0/nrf9280/cpuapparm440522
0.8%
siwx917_ek2708a/siwg917y111mgabaarm330488
0.6%
siwx917_rb4342a/siwg917m111mgtbaarm330491
0.6%
siwx917_dk2605a/siwg917m111mgtbaarm330499
0.6%
siwx917_rb4338a/siwg917m111mgtbaarm330505
0.6%
sixg301_rb4407a/simg301m104lilarm330761
0.4%
scobc_v1/versal_rpuarm220319
0.6%
imx952_evk/mimx9529/m7arm220459
0.4%
kit_pse84_ai/pse846gps2dbzc4a/m33arm220526
0.4%
kit_pse84_eval/pse846gps2dbzc4a/m33arm220534
0.4%
stm32h573i_dk/stm32h573xx/nsarm220775
0.3%
ubx_evknorab2/nrf54l10/cpuflprriscv110277
0.4%
bl54l15_dvk/nrf54l10/cpuflprriscv110278
0.4%
nrf54l15dk/nrf54l10/cpuflprriscv110279
0.4%
raytac_an54lq_db_15/nrf54l15/cpuflprriscv110340
0.3%
bl54l15_dvk/nrf54l15/cpuflprriscv110341
0.3%
ubx_evknorab2/nrf54l15/cpuflprriscv110342
0.3%
raytac_an54lv_db_15/nrf54l15/cpuflprriscv110344
0.3%
intel_adsp/cavs25/tgphxtensa110345
0.3%
nrf54l15dk/nrf54l15/cpuflprriscv110351
0.3%
nucleo_wb05kz/stm32wb05arm110353
0.3%
lp_em_cc2340r5/cc2340r5arm110369
0.3%
bl704l_dvk/bl704l20q2iwriscv110373
0.3%
weact_stm32g431_core/stm32g431xxarm110378
0.3%
rts5912_evb/rts5912arm110381
0.3%
nrf54lm20bsim/nrf54lm20a/cpuappposix110384
0.3%
eora_hub_900tb/esp32s3/procpuxtensa110391
0.3%
intel_adsp/cavs25xtensa110391
0.3%
xg22_ek2710a/efr32mg22e224f512im40arm110392
0.3%
bg22_ek4108a/efr32bg22c224f512im40arm110393
0.3%
waveshare_open103z/stm32f103xearm110395
0.3%
lyra_dvk_p/bgm220pc22hnaarm110396
0.3%
lyra_dvk_s/bgm220sc22hnaarm110396
0.3%
bgm220_ek4314a/bgm220pc22hnaarm110398
0.3%
xg22_rb4415a/efr32mg22e224f512im40arm110398
0.3%
slwrb4182a/efr32mg22c224f512im40arm110399
0.3%
slwrb4311a/bgm220pc22hnaarm110399
0.3%
sltb010a@0/efr32bg22c224f512im40arm110402
0.2%
sltb010a@2/efr32bg22c224f512im40arm110402
0.2%
nucleo_wb07cc/stm32wb07arm110418
0.2%
nrf5340bsim/nrf5340/cpunetposix110427
0.2%
nrf54l15bsim/nrf54l15/cpuappposix110427
0.2%
nucleo_wb09ke/stm32wb09arm110431
0.2%
mps2/an521/cpu0arm110442
0.2%
arduino_opta/stm32h747xx/m4arm110443
0.2%
innblue21/nrf9160arm110444
0.2%
innblue22/nrf9160arm110446
0.2%
nrf5340bsim/nrf5340/cpuappposix110446
0.2%
innblue21/nrf9160/nsarm110450
0.2%
innblue22/nrf9160/nsarm110450
0.2%
ruuvi_ruuvitag/nrf52832arm110454
0.2%
nrf54l15tag/nrf54l15/cpuapp/nsarm110456
0.2%
bg27_rb4111b/efr32bg27c320f768gj39arm110461
0.2%
xg27_rb4194a/efr32mg27c140f768im40arm110464
0.2%
bg27_rb4110b/efr32bg27c320f768gj39arm110465
0.2%
xg27_dk2602a/efr32bg27c140f768im40arm110471
0.2%
nucleo_wba25ce1/stm32wba25xxarm110476
0.2%
kit_pse84_ai/pse846gps2dbzc4a/m33/nsarm110479
0.2%
arduino_opta/stm32h747xx/m7arm110484
0.2%
bl5340_dvk/nrf5340/cpuapp/nsarm110490
0.2%
nrf54l15tag/nrf54l15/cpuapparm110490
0.2%
kit_pse84_eval/pse846gps2dbzc4a/m33/nsarm110491
0.2%
arduino_nano_matter/mgm240sd22vnaarm110508
0.2%
xiao_mg24/efr32mg24b220f1536im48arm110508
0.2%
lyra_24_dvk_p10/bgm240pb22vnaarm110509
0.2%
qemu_cortex_r5/zynqmp_rpuarm110509
0.2%
lyra_24_dvk_p20/bgm240pb32vnaarm110510
0.2%
lyra_24_dvk_p20rf/bgm240pb32vnnarm110510
0.2%
lyra_24_dvk_s10/bgm240sb22vnaarm110510
0.2%
xg24_ek2703a/efr32mg24b210f1536im48arm110516
0.2%
mgm260p_ek2713a/mgm260pd32vnaarm110517
0.2%
xg28_ek2705a/efr32zg28b312f1024im48arm110517
0.2%
xgm240_rb4316a/mgm240pb22vnaarm110517
0.2%
xgm240_rb4317a/mgm240pb32vnaarm110517
0.2%
xgm240_rb4318a/mgm240sd22vnaarm110517
0.2%
xg26_ek2709a/efr32mg26b510f3200im48arm110518
0.2%
xg24_dk2601b/efr32mg24b310f1536im48arm110519
0.2%
xg26_dk2608a/efr32mg26b510f3200im68arm110520
0.2%
xg29_rb4413a/efr32mg29b230f1024cm40arm110521
0.2%
bl5340_dvk/nrf5340/cpuapparm110532
0.2%
kit_pse84_ai/pse846gps2dbzc4a/m55arm110536
0.2%
bg29_rb4420a/efr32bg29b220f1024cj45arm110542
0.2%
xg29_rb4412a/efr32mg29b140f1024im40arm110553
0.2%
kit_pse84_eval/pse846gps2dbzc4a/m55arm110558
0.2%
esp32p4_function_ev_board/esp32p4/hpcoreriscv110613
0.2%
thingy53/nrf5340/cpuapp/nsarm110618
0.2%
ai_m64p_32s_kit/bl616cl4855riscv110636
0.2%
mps2/an383arm110686
0.1%
qemu_cortex_a9/xc7z007sarm110691
0.1%
xg21_rb4195b/efr32mg21b010f1024im32arm110697
0.1%
xg21_rb4196b/efr32mg21b020f1024im32arm110697
0.1%
nrf93m1dk@0.4.0/nrf54l15/cpuapp/nsarm110710
0.1%
nrf93m1dk@0.4.0/nrf54l15/cpuapparm110736
0.1%
thingy53/nrf5340/cpuapparm110740
0.1%
xg24_rb4188a/efr32mg24b220f1536im48arm110744
0.1%
xg24_rb4186c/efr32mg24b210f1536im48arm110747
0.1%
pinnacle_100_dvk/nrf52840arm110751
0.1%
quill_nrf52840_mesh/nrf52840arm110762
0.1%
xg24_rb4187c/efr32mg24b220f1536im48arm110777
0.1%
nrf52_bsim/nativeposix110828
0.1%

Tests With Failures

63 of 4,985 distinct test suites failed on at least one platform. "Instances" is how many platform variants of the test ran.

TestPathFailuresErrorFailedInstancesFailing platforms
mgmt.mcumgr.os.info.bttests/subsys/mgmt/mcumgr/os_mgmt_info43430159ai_m64p_32s_kit/bl616cl4855, arduino_nano_matter/mgm240sd22vna, bg22_ek4108a/efr32bg22c224f512im40, bg27_rb4110b/efr32bg27c320f768gj39, bg27_rb4111b/efr32bg27c320f768gj39, bg29_rb4420a/efr32bg29b220f1024cj45, bgm220_ek4314a/bgm220pc22hna, lyra_24_dvk_p10/bgm240pb22vna, lyra_24_dvk_p20/bgm240pb32vna, lyra_24_dvk_p20rf/bgm240pb32vnn, lyra_24_dvk_s10/bgm240sb22vna, lyra_dvk_p/bgm220pc22hna, …
drivers.sensor.shelltests/drivers/sensor/shell121201,661bl5340_dvk/nrf5340/cpuapp/ns, bl5340_dvk/nrf5340/cpuapp, innblue21/nrf9160/ns, innblue21/nrf9160, innblue22/nrf9160/ns, innblue22/nrf9160, mr_mcxn_t1/mcxn947/cpu1, nrf54l15tag/nrf54l15/cpuapp/ns, nrf54l15tag/nrf54l15/cpuapp, pinnacle_100_dvk/nrf52840, thingy53/nrf5340/cpuapp/ns, thingy53/nrf5340/cpuapp
arch.interrupt.minimallibctests/arch/common/interrupt8801,614bl54l15_dvk/nrf54l10/cpuflpr, bl54l15_dvk/nrf54l15/cpuflpr, nrf54l15dk/nrf54l10/cpuflpr, nrf54l15dk/nrf54l15/cpuflpr, raytac_an54lq_db_15/nrf54l15/cpuflpr, raytac_an54lv_db_15/nrf54l15/cpuflpr, ubx_evknorab2/nrf54l10/cpuflpr, ubx_evknorab2/nrf54l15/cpuflpr
drivers.mbox.mbox_datatests/drivers/mbox/mbox_data6601,631kit_pse84_ai/pse846gps2dbzc4a/m33/ns, kit_pse84_ai/pse846gps2dbzc4a/m33, kit_pse84_ai/pse846gps2dbzc4a/m55, kit_pse84_eval/pse846gps2dbzc4a/m33/ns, kit_pse84_eval/pse846gps2dbzc4a/m33, kit_pse84_eval/pse846gps2dbzc4a/m55
filesystem.lib_linktests/subsys/fs/lib_link5501,667nrf52_bsim/native, nrf5340bsim/nrf5340/cpuapp, nrf5340bsim/nrf5340/cpunet, nrf54l15bsim/nrf54l15/cpuapp, nrf54lm20bsim/nrf54lm20a/cpuapp
application_development.ram_context_for_isrtests/application_development/ram_context_for_isr4401,120nrf93m1dk@0.4.0/nrf54l15/cpuapp/ns, nrf93m1dk@0.4.0/nrf54l15/cpuapp, quill_nrf52840_mesh/nrf52840, rts5912_evb/rts5912
arch.arm.interrupt.no_optimizationstests/arch/arm/arm_interrupt4401,139siwx917_dk2605a/siwg917m111mgtba, siwx917_ek2708a/siwg917y111mgaba, siwx917_rb4338a/siwg917m111mgtba, siwx917_rb4342a/siwg917m111mgtba
arch.arm.swap.common.fpu_sharing.no_optimizationstests/arch/arm/arm_thread_swap4401,031siwx917_dk2605a/siwg917m111mgtba, siwx917_ek2708a/siwg917y111mgaba, siwx917_rb4338a/siwg917m111mgtba, siwx917_rb4342a/siwg917m111mgtba
arch.arm.swap.common.no_optimizationstests/arch/arm/arm_thread_swap4401,031siwx917_dk2605a/siwg917m111mgtba, siwx917_ek2708a/siwg917y111mgaba, siwx917_rb4338a/siwg917m111mgtba, siwx917_rb4342a/siwg917m111mgtba
llext.semihosttests/subsys/llext4408mps2/an383, mps2/an521/cpu0, qemu_cortex_a9/xc7z007s, qemu_cortex_r5/zynqmp_rpu
libraries.devicetree.api_exttests/lib/devicetree/api_ext3301,668arduino_opta/stm32h747xx/m4, arduino_opta/stm32h747xx/m7, weact_stm32g431_core/stm32g431xx
arch.arm.sw_vector_relay.sram_vector_tabletests/arch/arm/arm_sw_vector_relay2201,143kit_pse84_ai/pse846gps2dbzc4a/m33, kit_pse84_eval/pse846gps2dbzc4a/m33
arch.arm.swap.tztests/arch/arm/arm_thread_swap_tz2201,144mps4/corstone315/fvp/ns, mps4/corstone320/fvp/ns
arch.arm.swap.tz_offtests/arch/arm/arm_thread_swap_tz2201,144mps4/corstone315/fvp/ns, mps4/corstone320/fvp/ns
sample.llext.shellsamples/subsys/llext/shell_loader2201,294intel_adsp/cavs25/tgph, intel_adsp/cavs25
settings.functional.tfm-itstests/subsys/settings/functional/tfm_psa2201,675mps4/corstone315/fvp/ns, mps4/corstone320/fvp/ns
settings.functional.tfm-pstests/subsys/settings/functional/tfm_psa2201,675mps4/corstone315/fvp/ns, mps4/corstone320/fvp/ns
settings.tfm_psa_itstests/subsys/settings/tfm_psa2201,676mps4/corstone315/fvp/ns, mps4/corstone320/fvp/ns
settings.tfm_psa_pstests/subsys/settings/tfm_psa2201,676mps4/corstone315/fvp/ns, mps4/corstone320/fvp/ns
tfm.regression.ipc.lvl1tests/modules/tf-m/regression2201,672mps4/corstone315/fvp/ns, mps4/corstone320/fvp/ns
tfm.regression.ipc.lvl2tests/modules/tf-m/regression2201,673mps4/corstone315/fvp/ns, mps4/corstone320/fvp/ns
tfm.regression.sfntests/modules/tf-m/regression2201,673mps4/corstone315/fvp/ns, mps4/corstone320/fvp/ns
arch.arm.irq_vector_tabletests/arch/arm/arm_irq_vector_table1101,126lp_em_cc2340r5/cc2340r5
benchmark.kernel.footprints.pmtests/benchmarks/footprints1101,587beaglebadge/am62l3/a53
cpp.main.cpp14tests/lib/cpp/cxx1101,588beaglebadge/am62l3/a53
cpp.main.cpp17tests/lib/cpp/cxx1101,588beaglebadge/am62l3/a53
cpp.main.cpp20tests/lib/cpp/cxx1101,588beaglebadge/am62l3/a53
cpp.main.cpp23tests/lib/cpp/cxx1101,588beaglebadge/am62l3/a53
cpp.main.cpp26tests/lib/cpp/cxx1101,588beaglebadge/am62l3/a53
cpp.main.cpp2Atests/lib/cpp/cxx1101,588beaglebadge/am62l3/a53
cpp.main.cpp2Btests/lib/cpp/cxx1101,588beaglebadge/am62l3/a53
cpp.main.cpp98tests/lib/cpp/cxx1101,588beaglebadge/am62l3/a53
cpp.main.minimaltests/lib/cpp/cxx1101,596beaglebadge/am62l3/a53
cpp.main.picolibctests/lib/cpp/cxx1101,596beaglebadge/am62l3/a53
drivers.adctests/drivers/adc/adc_api110494waveshare_open103z/stm32f103xe
drivers.can.shelltests/drivers/can/shell1101,660mr_mcxn_t1/mcxn947/cpu1
drivers.disk.disk_performance.sdhctests/drivers/disk/disk_performance11071scobc_v1/versal_rpu
drivers.display.build.defaulttests/drivers/build_all/display11070esp32p4_function_ev_board/esp32p4/hpcore
drivers.display.check.shieldtests/drivers/display/display_check1101,661bl704l_dvk/bl704l20q2iw
drivers.dma.loop_transfertests/drivers/dma/loop_transfer110457imx952_evk/mimx9529/m7
drivers.gpio.gpio_nrftests/drivers/gpio/gpio_nrf1101,216ruuvi_ruuvitag/nrf52832
drivers.uart.async_api.lpuart.rt_nocachetests/drivers/uart/uart_async_api110452imx952_evk/mimx9529/m7
drivers.uart.basic_api.cdc_acmtests/drivers/uart/uart_basic_api110224nrf9280pdk@0.2.0/nrf9280/cpuapp
drivers.usb.udctests/drivers/udc110223nrf9280pdk@0.2.0/nrf9280/cpuapp
kernel.commontests/kernel/common1101,555rock_5b_plus/rk3588/smp
kernel.common.tlstests/kernel/common1101,555rock_5b_plus/rk3588/smp
kernel.devicetests/kernel/device1101,614beaglebadge/am62l3/a53
kernel.device.minimallibctests/kernel/device1101,614beaglebadge/am62l3/a53
kernel.device.pmtests/kernel/device1101,613beaglebadge/am62l3/a53
kernel.memory_protection.syscalls.kyieldtests/kernel/mem_protect/syscalls1101,607rock_5b_plus/rk3588/smp
kernel.memory_protection.syscalls.timeslicingtests/kernel/mem_protect/syscalls1101,607rock_5b_plus/rk3588/smp
kernel.semaphoretests/kernel/semaphore/semaphore1101,616rock_5b_plus/rk3588/smp
kernel.semaphore.usagetests/kernel/semaphore/sys_sem1101,608rock_5b_plus/rk3588/smp
lorawan.clock_sync.phytests/subsys/lorawan/clock_sync11031eora_hub_900tb/esp32s3/procpu
net.socket.tcptests/net/socket/tcp110244stm32h573i_dk/stm32h573xx/ns
net.socket.tcp.preempttests/net/socket/tcp110244stm32h573i_dk/stm32h573xx/ns
sample.filesystem.fat_fssamples/subsys/fs/fs_sample11071scobc_v1/versal_rpu
sample.net.quic.service.echo_clientsamples/net/quic/echo_client110114sixg301_rb4407a/simg301m104lil
sample.net.quic.service.echo_servicesamples/net/quic/echo_service11095sixg301_rb4407a/simg301m104lil
sample.net.sockets.dumb_http_serversamples/net/sockets/dumb_http_server1101,263mr_mcxn_t1/mcxn947/cpu1
sample.posix.gettimeofdaysamples/subsys/portability/posix/gettimeofday1101,257mr_mcxn_t1/mcxn947/cpu1
sample.usb.usb_device_next.midisamples/subsys/usb/midi110224nrf9280pdk@0.2.0/nrf9280/cpuapp
sample.usbd.loopbacksamples/subsys/usb/testusb110224nrf9280pdk@0.2.0/nrf9280/cpuapp

Failure Reasons

Reasons as reported by twister, with paths and addresses folded so similar failures group together.

ReasonOccurrencesDistinct testsShare of failures
CMake build failure - CMake Error at extensions.cmake:N (message): Blob for path431
26.9%
Build failure2616
16.2%
Build failure - error: data definition has no type or storage class [-Werror]111
6.9%
Build failure - undefined reference to `__device_dts_ord_50'1010
6.2%
Build failure - in function `sys_clock_driver_init':81
5.0%
Build failure - undefined reference to `log_const_littlefs'51
3.1%
Not in testsuite platform allow list but is one of the integration platforms41
2.5%
Build failure - error: 'USBHS_PHY_CONFIG_PLLITUNE_Pos' undeclared here (not in a function)44
2.5%
Build failure - ld.bfd: warning: orphan section `.__device_deps_pass1' from `app/libapp.a(fake_driver.c.obj)' being placed in section `.__de…31
1.9%
Build failure - undefined reference to `__device_dts_ord_31'33
1.9%
Build failure - undefined reference to `__device_dts_ord_35'33
1.9%
Build failure - undefined reference to `__device_dts_ord_32'33
1.9%
Build failure - undefined reference to `__device_dts_ord_26'33
1.9%
CMake build failure - CMake Error at sysbuild.cmake:6 (message): Target kit_pse84_ai not supported for this sample. There is no remote31
1.9%
CMake build failure - CMake Error at sysbuild.cmake:6 (message): Target kit_pse84_eval not supported for this sample. There is no remote31
1.9%
Build failure - undefined reference to `__device_dts_ord_60'33
1.9%
Build failure - error: 'adc_sub_stm32_init' defined but not used [-Werror=unused-function]31
1.9%
Build failure - undefined reference to `__device_dts_ord_12'22
1.2%
Build failure - error: multiple registrations at table_index N for irq N (0x…)22
1.2%
Build failure - error: 'SetSysClock' defined but not used [-Werror=unused-function]22
1.2%
Build failure - ld.bfd: warning: orphan section `.llext_heap' from `zephyr/subsys/llext/libsubsys__llext.a(llext_kheap.c.obj)' being placed …21
1.2%
Build failure - error: #error "Unsupported partial support for ECC curves acceleration, see docs/driver-only-builds.md"22
1.2%
Build failure - error: '__device_dts_ord_132' undeclared here (not in a function); did you mean '__device_dts_ord_13'?22
1.2%
Build failure - error: 'gpio_wake_init_once' undeclared (first use in this function)11
0.6%
Build failure - undefined reference to `arch_irq_connect_dynamic'11
0.6%
Build failure - undefined reference to `__device_dts_ord_48'11
0.6%
Build failure - error: '__device_dts_ord_65' undeclared here (not in a function); did you mean '__device_dts_ord_68'?11
0.6%
Build failure - error: #error "No disk device defined, is your board supported?"11
0.6%
Build failure - ld.bfd: region overflowed11
0.6%
Build failure - undefined reference to `nrfx_gpiote_channel_alloc'11
0.6%
Build failure - error: '__device_dts_ord_178' undeclared here (not in a function); did you mean '__device_dts_ord_18'?11
0.6%
Build failure - undefined reference to `lorawan_emul_register_uplink_callback'11
0.6%
Build failure - error: #error Wrong FF_VOLUMES setting11
0.6%

Failure Details

Every failing test instance, with the tail of its build log. Filter by platform or test to narrow it down.

PlatformTestStatusReasonBuildRetries
ai_m64p_32s_kit/bl616cl4855mgmt.mcumgr.os.info.bterrorCMake build failure - CMake Error at /__w/zephyr/zephyr/cmake/modules/extensions.cmake:2482 (message): Blob for path
log
CMake Error at /__w/zephyr/zephyr/cmake/modules/extensions.cmake:2482 (message):
6s0
arduino_nano_matter/mgm240sd22vnamgmt.mcumgr.os.info.bterrorCMake build failure - CMake Error at /__w/zephyr/zephyr/cmake/modules/extensions.cmake:2482 (message): Blob for path
log
CMake Error at /__w/zephyr/zephyr/cmake/modules/extensions.cmake:2482 (message):
6s0
arduino_opta/stm32h747xx/m4libraries.devicetree.api_exterrorBuild failure - error: 'adc_sub_stm32_init' defined but not used [-Werror=unused-function]
log
…175] Building C object zephyr/arch/arch/arm/core/CMakeFiles/arch__arm__core.dir/fatal.c.obj
/__w/zephyr/zephyr/drivers/adc/adc_stm32.c:2365:12: error: 'adc_sub_stm32_init' defined but not used [-Werror=unused-function]
/__w/zephyr/zephyr/drivers/adc/adc_stm32.c:2121:12: error: 'adc_stm32_channel_setup' defined but not used [-Werror=unused-function]
/__w/zephyr/zephyr/drivers/adc/adc_stm32.c:1880:12: error: 'adc_stm32_read_sync' defined but not used [-Werror=unused-function]
/__w/zephyr/zephyr/drivers/adc/adc_stm32.c:1726:13: error: 'adc_stm32_isr' defined but not used [-Werror=unused-function]
123s0
arduino_opta/stm32h747xx/m7libraries.devicetree.api_exterrorBuild failure - error: 'adc_sub_stm32_init' defined but not used [-Werror=unused-function]
log
…214] Building C object zephyr/arch/arch/arm/core/CMakeFiles/arch__arm__core.dir/fatal.c.obj
/__w/zephyr/zephyr/drivers/adc/adc_stm32.c:2365:12: error: 'adc_sub_stm32_init' defined but not used [-Werror=unused-function]
/__w/zephyr/zephyr/drivers/adc/adc_stm32.c:2121:12: error: 'adc_stm32_channel_setup' defined but not used [-Werror=unused-function]
/__w/zephyr/zephyr/drivers/adc/adc_stm32.c:1880:12: error: 'adc_stm32_read_sync' defined but not used [-Werror=unused-function]
/__w/zephyr/zephyr/drivers/adc/adc_stm32.c:1726:13: error: 'adc_stm32_isr' defined but not used [-Werror=unused-function]
171s0
beaglebadge/am62l3/a53benchmark.kernel.footprints.pmerrorBuild failure - undefined reference to `__device_dts_ord_48'
log
…/toolchains/zephyr-sdk-1.0.1/gnu/aarch64-zephyr-elf/bin/../lib/gcc/aarch64-zephyr-elf/14.3.0/space" -lc -lgcc && cd /__w/zephyr/zephyr/twister-out/beaglebadge_am62l3_a53/zephyr_gnu/tests/benchmarks/footprints/benchmark.kernel.footprints.pm/zephyr && /usr/bin/cmake -E true
/opt/toolchains/zephyr-sdk-1.0.1/gnu/aarch64-zephyr-elf/bin/../lib/gcc/aarch64-zephyr-elf/14.3.0/../../../../aarch64-zephyr-elf/bin/ld.bfd: zephyr/drivers/serial/libdrivers__serial.a(uart_ns16550.c.obj):(.data.__pm_device_dts_ord_49+0x20): undefined reference to `__device_dts_ord_48'
collect2: error: ld returned 1 exit status
100s0
beaglebadge/am62l3/a53cpp.main.cpp14errorBuild failure - undefined reference to `__device_dts_ord_50'
log
…UBLE_PRINTF_SCANF -L"/opt/toolchains/zephyr-sdk-1.0.1/gnu/aarch64-zephyr-elf/bin/../lib/gcc/aarch64-zephyr-elf/14.3.0/space"  -lc -lgcc && cd /__w/zephyr/zephyr/twister-out/beaglebadge_am62l3_a53/zephyr_gnu/tests/lib/cpp/cxx/cpp.main.cpp14/zephyr && /usr/bin/cmake -E true
/opt/toolchains/zephyr-sdk-1.0.1/gnu/aarch64-zephyr-elf/bin/../lib/gcc/aarch64-zephyr-elf/14.3.0/../../../../aarch64-zephyr-elf/bin/ld.bfd: zephyr/drivers/serial/libdrivers__serial.a(uart_ns16550.c.obj):(.data.__pm_device_dts_ord_51+0x20): undefined reference to `__device_dts_ord_50'
collect2: error: ld returned 1 exit status
49s0
beaglebadge/am62l3/a53cpp.main.cpp17errorBuild failure - undefined reference to `__device_dts_ord_50'
log
…UBLE_PRINTF_SCANF -L"/opt/toolchains/zephyr-sdk-1.0.1/gnu/aarch64-zephyr-elf/bin/../lib/gcc/aarch64-zephyr-elf/14.3.0/space"  -lc -lgcc && cd /__w/zephyr/zephyr/twister-out/beaglebadge_am62l3_a53/zephyr_gnu/tests/lib/cpp/cxx/cpp.main.cpp17/zephyr && /usr/bin/cmake -E true
/opt/toolchains/zephyr-sdk-1.0.1/gnu/aarch64-zephyr-elf/bin/../lib/gcc/aarch64-zephyr-elf/14.3.0/../../../../aarch64-zephyr-elf/bin/ld.bfd: zephyr/drivers/serial/libdrivers__serial.a(uart_ns16550.c.obj):(.data.__pm_device_dts_ord_51+0x20): undefined reference to `__device_dts_ord_50'
collect2: error: ld returned 1 exit status
132s0
beaglebadge/am62l3/a53cpp.main.cpp20errorBuild failure - undefined reference to `__device_dts_ord_50'
log
…UBLE_PRINTF_SCANF -L"/opt/toolchains/zephyr-sdk-1.0.1/gnu/aarch64-zephyr-elf/bin/../lib/gcc/aarch64-zephyr-elf/14.3.0/space"  -lc -lgcc && cd /__w/zephyr/zephyr/twister-out/beaglebadge_am62l3_a53/zephyr_gnu/tests/lib/cpp/cxx/cpp.main.cpp20/zephyr && /usr/bin/cmake -E true
/opt/toolchains/zephyr-sdk-1.0.1/gnu/aarch64-zephyr-elf/bin/../lib/gcc/aarch64-zephyr-elf/14.3.0/../../../../aarch64-zephyr-elf/bin/ld.bfd: zephyr/drivers/serial/libdrivers__serial.a(uart_ns16550.c.obj):(.data.__pm_device_dts_ord_51+0x20): undefined reference to `__device_dts_ord_50'
collect2: error: ld returned 1 exit status
64s0
beaglebadge/am62l3/a53cpp.main.cpp23errorBuild failure - undefined reference to `__device_dts_ord_50'
log
…UBLE_PRINTF_SCANF -L"/opt/toolchains/zephyr-sdk-1.0.1/gnu/aarch64-zephyr-elf/bin/../lib/gcc/aarch64-zephyr-elf/14.3.0/space"  -lc -lgcc && cd /__w/zephyr/zephyr/twister-out/beaglebadge_am62l3_a53/zephyr_gnu/tests/lib/cpp/cxx/cpp.main.cpp23/zephyr && /usr/bin/cmake -E true
/opt/toolchains/zephyr-sdk-1.0.1/gnu/aarch64-zephyr-elf/bin/../lib/gcc/aarch64-zephyr-elf/14.3.0/../../../../aarch64-zephyr-elf/bin/ld.bfd: zephyr/drivers/serial/libdrivers__serial.a(uart_ns16550.c.obj):(.data.__pm_device_dts_ord_51+0x20): undefined reference to `__device_dts_ord_50'
collect2: error: ld returned 1 exit status
74s0
beaglebadge/am62l3/a53cpp.main.cpp26errorBuild failure - undefined reference to `__device_dts_ord_50'
log
…UBLE_PRINTF_SCANF -L"/opt/toolchains/zephyr-sdk-1.0.1/gnu/aarch64-zephyr-elf/bin/../lib/gcc/aarch64-zephyr-elf/14.3.0/space"  -lc -lgcc && cd /__w/zephyr/zephyr/twister-out/beaglebadge_am62l3_a53/zephyr_gnu/tests/lib/cpp/cxx/cpp.main.cpp26/zephyr && /usr/bin/cmake -E true
/opt/toolchains/zephyr-sdk-1.0.1/gnu/aarch64-zephyr-elf/bin/../lib/gcc/aarch64-zephyr-elf/14.3.0/../../../../aarch64-zephyr-elf/bin/ld.bfd: zephyr/drivers/serial/libdrivers__serial.a(uart_ns16550.c.obj):(.data.__pm_device_dts_ord_51+0x20): undefined reference to `__device_dts_ord_50'
collect2: error: ld returned 1 exit status
62s0
beaglebadge/am62l3/a53cpp.main.cpp2AerrorBuild failure - undefined reference to `__device_dts_ord_50'
log
…UBLE_PRINTF_SCANF -L"/opt/toolchains/zephyr-sdk-1.0.1/gnu/aarch64-zephyr-elf/bin/../lib/gcc/aarch64-zephyr-elf/14.3.0/space"  -lc -lgcc && cd /__w/zephyr/zephyr/twister-out/beaglebadge_am62l3_a53/zephyr_gnu/tests/lib/cpp/cxx/cpp.main.cpp2A/zephyr && /usr/bin/cmake -E true
/opt/toolchains/zephyr-sdk-1.0.1/gnu/aarch64-zephyr-elf/bin/../lib/gcc/aarch64-zephyr-elf/14.3.0/../../../../aarch64-zephyr-elf/bin/ld.bfd: zephyr/drivers/serial/libdrivers__serial.a(uart_ns16550.c.obj):(.data.__pm_device_dts_ord_51+0x20): undefined reference to `__device_dts_ord_50'
collect2: error: ld returned 1 exit status
57s0
beaglebadge/am62l3/a53cpp.main.cpp2BerrorBuild failure - undefined reference to `__device_dts_ord_50'
log
…UBLE_PRINTF_SCANF -L"/opt/toolchains/zephyr-sdk-1.0.1/gnu/aarch64-zephyr-elf/bin/../lib/gcc/aarch64-zephyr-elf/14.3.0/space"  -lc -lgcc && cd /__w/zephyr/zephyr/twister-out/beaglebadge_am62l3_a53/zephyr_gnu/tests/lib/cpp/cxx/cpp.main.cpp2B/zephyr && /usr/bin/cmake -E true
/opt/toolchains/zephyr-sdk-1.0.1/gnu/aarch64-zephyr-elf/bin/../lib/gcc/aarch64-zephyr-elf/14.3.0/../../../../aarch64-zephyr-elf/bin/ld.bfd: zephyr/drivers/serial/libdrivers__serial.a(uart_ns16550.c.obj):(.data.__pm_device_dts_ord_51+0x20): undefined reference to `__device_dts_ord_50'
collect2: error: ld returned 1 exit status
63s0
beaglebadge/am62l3/a53cpp.main.cpp98errorBuild failure - undefined reference to `__device_dts_ord_50'
log
…UBLE_PRINTF_SCANF -L"/opt/toolchains/zephyr-sdk-1.0.1/gnu/aarch64-zephyr-elf/bin/../lib/gcc/aarch64-zephyr-elf/14.3.0/space"  -lc -lgcc && cd /__w/zephyr/zephyr/twister-out/beaglebadge_am62l3_a53/zephyr_gnu/tests/lib/cpp/cxx/cpp.main.cpp98/zephyr && /usr/bin/cmake -E true
/opt/toolchains/zephyr-sdk-1.0.1/gnu/aarch64-zephyr-elf/bin/../lib/gcc/aarch64-zephyr-elf/14.3.0/../../../../aarch64-zephyr-elf/bin/ld.bfd: zephyr/drivers/serial/libdrivers__serial.a(uart_ns16550.c.obj):(.data.__pm_device_dts_ord_51+0x20): undefined reference to `__device_dts_ord_50'
collect2: error: ld returned 1 exit status
79s0
beaglebadge/am62l3/a53cpp.main.minimalerrorBuild failure - undefined reference to `__device_dts_ord_50'
log
…=_irq_vector_table -L"/opt/toolchains/zephyr-sdk-1.0.1/gnu/aarch64-zephyr-elf/bin/../lib/gcc/aarch64-zephyr-elf/14.3.0/space"   -lgcc && cd /__w/zephyr/zephyr/twister-out/beaglebadge_am62l3_a53/zephyr_gnu/tests/lib/cpp/cxx/cpp.main.minimal/zephyr && /usr/bin/cmake -E true
/opt/toolchains/zephyr-sdk-1.0.1/gnu/aarch64-zephyr-elf/bin/../lib/gcc/aarch64-zephyr-elf/14.3.0/../../../../aarch64-zephyr-elf/bin/ld.bfd: zephyr/drivers/serial/libdrivers__serial.a(uart_ns16550.c.obj):(.data.__pm_device_dts_ord_51+0x20): undefined reference to `__device_dts_ord_50'
collect2: error: ld returned 1 exit status
77s0
beaglebadge/am62l3/a53cpp.main.picolibcerrorBuild failure - undefined reference to `__device_dts_ord_50'
log
…E_PRINTF_SCANF -L"/opt/toolchains/zephyr-sdk-1.0.1/gnu/aarch64-zephyr-elf/bin/../lib/gcc/aarch64-zephyr-elf/14.3.0/space"  -lc -lgcc && cd /__w/zephyr/zephyr/twister-out/beaglebadge_am62l3_a53/zephyr_gnu/tests/lib/cpp/cxx/cpp.main.picolibc/zephyr && /usr/bin/cmake -E true
/opt/toolchains/zephyr-sdk-1.0.1/gnu/aarch64-zephyr-elf/bin/../lib/gcc/aarch64-zephyr-elf/14.3.0/../../../../aarch64-zephyr-elf/bin/ld.bfd: zephyr/drivers/serial/libdrivers__serial.a(uart_ns16550.c.obj):(.data.__pm_device_dts_ord_51+0x20): undefined reference to `__device_dts_ord_50'
collect2: error: ld returned 1 exit status
81s0
beaglebadge/am62l3/a53kernel.deviceerrorBuild failure - undefined reference to `__device_dts_ord_60'
log
…UBLE_PRINTF_SCANF -L"/opt/toolchains/zephyr-sdk-1.0.1/gnu/aarch64-zephyr-elf/bin/../lib/gcc/aarch64-zephyr-elf/14.3.0/space" -lc -lgcc && cd /__w/zephyr/zephyr/twister-out/beaglebadge_am62l3_a53/zephyr_gnu/tests/kernel/device/kernel.device/zephyr && /usr/bin/cmake -E true
/opt/toolchains/zephyr-sdk-1.0.1/gnu/aarch64-zephyr-elf/bin/../lib/gcc/aarch64-zephyr-elf/14.3.0/../../../../aarch64-zephyr-elf/bin/ld.bfd: zephyr/drivers/serial/libdrivers__serial.a(uart_ns16550.c.obj):(.data.__pm_device_dts_ord_61+0x20): undefined reference to `__device_dts_ord_60'
collect2: error: ld returned 1 exit status
144s0
beaglebadge/am62l3/a53kernel.device.minimallibcerrorBuild failure - undefined reference to `__device_dts_ord_60'
log
…or_table -L"/opt/toolchains/zephyr-sdk-1.0.1/gnu/aarch64-zephyr-elf/bin/../lib/gcc/aarch64-zephyr-elf/14.3.0/space"  -lgcc && cd /__w/zephyr/zephyr/twister-out/beaglebadge_am62l3_a53/zephyr_gnu/tests/kernel/device/kernel.device.minimallibc/zephyr && /usr/bin/cmake -E true
/opt/toolchains/zephyr-sdk-1.0.1/gnu/aarch64-zephyr-elf/bin/../lib/gcc/aarch64-zephyr-elf/14.3.0/../../../../aarch64-zephyr-elf/bin/ld.bfd: zephyr/drivers/serial/libdrivers__serial.a(uart_ns16550.c.obj):(.data.__pm_device_dts_ord_61+0x20): undefined reference to `__device_dts_ord_60'
collect2: error: ld returned 1 exit status
152s0
beaglebadge/am62l3/a53kernel.device.pmerrorBuild failure - undefined reference to `__device_dts_ord_60'
log
…E_PRINTF_SCANF -L"/opt/toolchains/zephyr-sdk-1.0.1/gnu/aarch64-zephyr-elf/bin/../lib/gcc/aarch64-zephyr-elf/14.3.0/space" -lc -lgcc && cd /__w/zephyr/zephyr/twister-out/beaglebadge_am62l3_a53/zephyr_gnu/tests/kernel/device/kernel.device.pm/zephyr && /usr/bin/cmake -E true
/opt/toolchains/zephyr-sdk-1.0.1/gnu/aarch64-zephyr-elf/bin/../lib/gcc/aarch64-zephyr-elf/14.3.0/../../../../aarch64-zephyr-elf/bin/ld.bfd: zephyr/drivers/serial/libdrivers__serial.a(uart_ns16550.c.obj):(.data.__pm_device_dts_ord_61+0x20): undefined reference to `__device_dts_ord_60'
collect2: error: ld returned 1 exit status
68s0
bg22_ek4108a/efr32bg22c224f512im40mgmt.mcumgr.os.info.bterrorCMake build failure - CMake Error at /__w/zephyr/zephyr/cmake/modules/extensions.cmake:2482 (message): Blob for path
log
CMake Error at /__w/zephyr/zephyr/cmake/modules/extensions.cmake:2482 (message):
6s0
bg27_rb4110b/efr32bg27c320f768gj39mgmt.mcumgr.os.info.bterrorCMake build failure - CMake Error at /__w/zephyr/zephyr/cmake/modules/extensions.cmake:2482 (message): Blob for path
log
CMake Error at /__w/zephyr/zephyr/cmake/modules/extensions.cmake:2482 (message):
6s0
bg27_rb4111b/efr32bg27c320f768gj39mgmt.mcumgr.os.info.bterrorCMake build failure - CMake Error at /__w/zephyr/zephyr/cmake/modules/extensions.cmake:2482 (message): Blob for path
log
CMake Error at /__w/zephyr/zephyr/cmake/modules/extensions.cmake:2482 (message):
6s0
bg29_rb4420a/efr32bg29b220f1024cj45mgmt.mcumgr.os.info.bterrorCMake build failure - CMake Error at /__w/zephyr/zephyr/cmake/modules/extensions.cmake:2482 (message): Blob for path
log
CMake Error at /__w/zephyr/zephyr/cmake/modules/extensions.cmake:2482 (message):
6s0
bgm220_ek4314a/bgm220pc22hnamgmt.mcumgr.os.info.bterrorCMake build failure - CMake Error at /__w/zephyr/zephyr/cmake/modules/extensions.cmake:2482 (message): Blob for path
log
CMake Error at /__w/zephyr/zephyr/cmake/modules/extensions.cmake:2482 (message):
6s0
bl5340_dvk/nrf5340/cpuappdrivers.sensor.shellerrorBuild failure - error: data definition has no type or storage class [-Werror]
log
…bj
/__w/zephyr/zephyr/drivers/sensor/bosch/bme680/bme680.c:520:9: error: data definition has no type or storage class [-Werror]
/__w/zephyr/zephyr/drivers/sensor/bosch/bme680/bme680.c:520:9: error: type defaults to 'int' in declaration of 'I2C_DT_IODEV_DEFINE' [-Wimplicit-int]
/__w/zephyr/zephyr/drivers/sensor/bosch/bme680/bme680.c:558:23: error: parameter names (without types) in function declaration [-Wdeclaration-missing-parameter-type]
/__w/zephyr/zephyr/drivers/sensor/bosch/bme680/bme680.c:530:23: error: 'bme680_iodev_0' undeclared here (not in a function); did you mean 'bme680_config_0'?
132s0
bl5340_dvk/nrf5340/cpuapp/nsdrivers.sensor.shellerrorBuild failure - error: data definition has no type or storage class [-Werror]
log
…bj
/__w/zephyr/zephyr/drivers/sensor/bosch/bme680/bme680.c:520:9: error: data definition has no type or storage class [-Werror]
/__w/zephyr/zephyr/drivers/sensor/bosch/bme680/bme680.c:520:9: error: type defaults to 'int' in declaration of 'I2C_DT_IODEV_DEFINE' [-Wimplicit-int]
/__w/zephyr/zephyr/drivers/sensor/bosch/bme680/bme680.c:558:23: error: parameter names (without types) in function declaration [-Wdeclaration-missing-parameter-type]
/__w/zephyr/zephyr/drivers/sensor/bosch/bme680/bme680.c:530:23: error: 'bme680_iodev_0' undeclared here (not in a function); did you mean 'bme680_config_0'?
223s0
bl54l15_dvk/nrf54l10/cpuflprarch.interrupt.minimallibcerrorBuild failure - in function `sys_clock_driver_init':
log
…-sort-section=alignment  -Wl,-u,_OffsetAbsSyms  -Wl,-u,_ConfigAbsSyms  -nostdlib  -static  -znoexecstack  -Wl,-X  -Wl,-N  -Wl,--orphan-handling=warn  -Wl,-no-pie  -Wl,--undefined=_sw_isr_table  -Wl,--undefined=_irq_vector_table -L"/opt/toolchains/zephyr-sdk-1.0.1/gnu/riscv64-zephyr-elf/bin/../lib/gcc/riscv64-zephyr-elf/14.3.0/rv32emc_zicsr_zcb_zba_zbb_zbc_zbs/ilp32e/space"  -lgcc && cd /__w/zephyr/zephyr/twister-out/bl54l15_dvk_nrf54l10_cpuflpr/zephyr_gnu/tests/arch/common/interrupt/arch.interrupt.minimallibc/interrupt/zephyr && /usr/bin/cmake -E true
collect2: error: ld returned 1 exit status
136s0
bl54l15_dvk/nrf54l15/cpuflprarch.interrupt.minimallibcerrorBuild failure - in function `sys_clock_driver_init':
log
…-sort-section=alignment  -Wl,-u,_OffsetAbsSyms  -Wl,-u,_ConfigAbsSyms  -nostdlib  -static  -znoexecstack  -Wl,-X  -Wl,-N  -Wl,--orphan-handling=warn  -Wl,-no-pie  -Wl,--undefined=_sw_isr_table  -Wl,--undefined=_irq_vector_table -L"/opt/toolchains/zephyr-sdk-1.0.1/gnu/riscv64-zephyr-elf/bin/../lib/gcc/riscv64-zephyr-elf/14.3.0/rv32emc_zicsr_zcb_zba_zbb_zbc_zbs/ilp32e/space"  -lgcc && cd /__w/zephyr/zephyr/twister-out/bl54l15_dvk_nrf54l15_cpuflpr/zephyr_gnu/tests/arch/common/interrupt/arch.interrupt.minimallibc/interrupt/zephyr && /usr/bin/cmake -E true
collect2: error: ld returned 1 exit status
148s0
bl704l_dvk/bl704l20q2iwdrivers.display.check.shielderrorBuild failure - undefined reference to `__device_dts_ord_12'
log
…k-1.0.1/gnu/riscv64-zephyr-elf/bin/../lib/gcc/riscv64-zephyr-elf/14.3.0/../../../../riscv64-zephyr-elf/bin/ld.bfd: zephyr/drivers/display/libdrivers__display.a(display_st730x.c.obj):(.rodata.configDT_N_S_mipi_dbi_st7305_S_st7305_0+0x10): undefined reference to `__device_dts_ord_12'
/opt/toolchains/zephyr-sdk-1.0.1/gnu/riscv64-zephyr-elf/bin/../lib/gcc/riscv64-zephyr-elf/14.3.0/../../../../riscv64-zephyr-elf/bin/ld.bfd: zephyr/drivers/spi/libdrivers__spi.a(spi_bflb.c.obj):(.srodata.__compound_literal.0+0x0): undefined reference to `__device_dts_ord_12'
collect2: error: ld returned 1 exit status
115s0
eora_hub_900tb/esp32s3/procpulorawan.clock_sync.phyerrorBuild failure - undefined reference to `lorawan_emul_register_uplink_callback'
log
…send_downlink'
/opt/toolchains/zephyr-sdk-1.0.1/gnu/xtensa-espressif_esp32s3_zephyr-elf/bin/../lib/gcc/xtensa-espressif_esp32s3_zephyr-elf/14.3.0/../../../../xtensa-espressif_esp32s3_zephyr-elf/bin/ld.bfd: /__w/zephyr/zephyr/tests/subsys/lorawan/clock_sync/src/main.c:135:(.text._clock_sync_test_device_app_time_periodicity_wrapper+0x193): undefined reference to `lorawan_emul_send_downlink'
/__w/zephyr/zephyr/tests/subsys/lorawan/clock_sync/src/main.c:90:(.text._clock_sync_test_app_time_wrapper+0x10f): undefined reference to `lorawan_emul_send_downlink'
collect2: error: ld returned 1 exit status
191s0
esp32p4_function_ev_board/esp32p4/hpcoredrivers.display.build.defaulterrorBuild failure - ld.bfd: region overflowed
log
…bc-suboptimal_for_misaligned_mem.ld  -T/__w/zephyr/modules/hal/espressif/zephyr/esp32p4/../../components/esp_hal_wdt/esp32p4/rom.wdt.ld  -T/__w/zephyr/modules/hal/espressif/zephyr/esp32p4/../../components/riscv/ld/rom.api.ld -L"/opt/toolchains/zephyr-sdk-1.0.1/gnu/riscv64-zephyr-elf/bin/../lib/gcc/riscv64-zephyr-elf/14.3.0/rv32imafc_zicsr_zifencei/ilp32f/space" -lc -lgcc && cd /__w/zephyr/zephyr/twister-out/esp32p4_function_ev_board_esp32p4_hpcore/zephyr_gnu/tests/drivers/build_all/display/drivers.display.build.default/zephyr && /usr/bin/cmake -E true
collect2: error: ld returned 1 exit status
353s0
imx952_evk/mimx9529/m7drivers.dma.loop_transfererrorBuild failure - error: multiple registrations at table_index 126 for irq 126 (0x7e)
log
[54/194] Building C object zephyr/arch/arch/arm/core/CMakeFiles/arch__arm__core.dir/fatal.c.obj
[162/194] Building C object zephyr/kernel/CMakeFiles/kernel.dir/fatal.c.obj
gen_isr_tables.py: error: multiple registrations at table_index 126 for irq 126  (0x7e)
189s0
imx952_evk/mimx9529/m7drivers.uart.async_api.lpuart.rt_nocacheerrorBuild failure - error: multiple registrations at table_index 126 for irq 126 (0x7e)
log
[53/193] Building C object zephyr/arch/arch/arm/core/CMakeFiles/arch__arm__core.dir/fatal.c.obj
[161/193] Building C object zephyr/kernel/CMakeFiles/kernel.dir/fatal.c.obj
gen_isr_tables.py: error: multiple registrations at table_index 126 for irq 126  (0x7e)
232s0
innblue21/nrf9160drivers.sensor.shellerrorBuild failure - error: data definition has no type or storage class [-Werror]
log
…bj
/__w/zephyr/zephyr/drivers/sensor/bosch/bme680/bme680.c:520:9: error: data definition has no type or storage class [-Werror]
/__w/zephyr/zephyr/drivers/sensor/bosch/bme680/bme680.c:520:9: error: type defaults to 'int' in declaration of 'I2C_DT_IODEV_DEFINE' [-Wimplicit-int]
/__w/zephyr/zephyr/drivers/sensor/bosch/bme680/bme680.c:558:23: error: parameter names (without types) in function declaration [-Wdeclaration-missing-parameter-type]
/__w/zephyr/zephyr/drivers/sensor/bosch/bme680/bme680.c:530:23: error: 'bme680_iodev_0' undeclared here (not in a function); did you mean 'bme680_config_0'?
125s0
innblue21/nrf9160/nsdrivers.sensor.shellerrorBuild failure - error: data definition has no type or storage class [-Werror]
log
…bj
/__w/zephyr/zephyr/drivers/sensor/bosch/bme680/bme680.c:520:9: error: data definition has no type or storage class [-Werror]
/__w/zephyr/zephyr/drivers/sensor/bosch/bme680/bme680.c:520:9: error: type defaults to 'int' in declaration of 'I2C_DT_IODEV_DEFINE' [-Wimplicit-int]
/__w/zephyr/zephyr/drivers/sensor/bosch/bme680/bme680.c:558:23: error: parameter names (without types) in function declaration [-Wdeclaration-missing-parameter-type]
/__w/zephyr/zephyr/drivers/sensor/bosch/bme680/bme680.c:530:23: error: 'bme680_iodev_0' undeclared here (not in a function); did you mean 'bme680_config_0'?
190s0
innblue22/nrf9160drivers.sensor.shellerrorBuild failure - error: data definition has no type or storage class [-Werror]
log
…bj
/__w/zephyr/zephyr/drivers/sensor/bosch/bme680/bme680.c:520:9: error: data definition has no type or storage class [-Werror]
/__w/zephyr/zephyr/drivers/sensor/bosch/bme680/bme680.c:520:9: error: type defaults to 'int' in declaration of 'I2C_DT_IODEV_DEFINE' [-Wimplicit-int]
/__w/zephyr/zephyr/drivers/sensor/bosch/bme680/bme680.c:558:23: error: parameter names (without types) in function declaration [-Wdeclaration-missing-parameter-type]
/__w/zephyr/zephyr/drivers/sensor/bosch/bme680/bme680.c:530:23: error: 'bme680_iodev_0' undeclared here (not in a function); did you mean 'bme680_config_0'?
132s0
innblue22/nrf9160/nsdrivers.sensor.shellerrorBuild failure - error: data definition has no type or storage class [-Werror]
log
…bj
/__w/zephyr/zephyr/drivers/sensor/bosch/bme680/bme680.c:520:9: error: data definition has no type or storage class [-Werror]
/__w/zephyr/zephyr/drivers/sensor/bosch/bme680/bme680.c:520:9: error: type defaults to 'int' in declaration of 'I2C_DT_IODEV_DEFINE' [-Wimplicit-int]
/__w/zephyr/zephyr/drivers/sensor/bosch/bme680/bme680.c:558:23: error: parameter names (without types) in function declaration [-Wdeclaration-missing-parameter-type]
/__w/zephyr/zephyr/drivers/sensor/bosch/bme680/bme680.c:530:23: error: 'bme680_iodev_0' undeclared here (not in a function); did you mean 'bme680_config_0'?
199s0
intel_adsp/cavs25sample.llext.shellerrorBuild failure - ld.bfd: warning: orphan section `.llext_heap' from `zephyr/subsys/llext/libsubsys__llext.a(llext_kheap.c.obj)' being placed in section `.llext_heap'
log
…-Wl,-u,_OffsetAbsSyms  -Wl,-u,_ConfigAbsSyms  -nostdlib  -static  -znoexecstack  -Wl,-X  -Wl,-N  -Wl,--orphan-handling=warn  -Wl,-no-pie  -Wl,--undefined=_sw_isr_table  -Wl,--undefined=_irq_vector_table  -specs=picolibc.specs  -DPICOLIBC_LONG_LONG_PRINTF_SCANF -L"/opt/toolchains/zephyr-sdk-1.0.1/gnu/xtensa-intel_tgl_adsp_zephyr-elf/bin/../lib/gcc/xtensa-intel_tgl_adsp_zephyr-elf/14.3.0/space" -lc -lgcc && cd /__w/zephyr/zephyr/twister-out/intel_adsp_cavs25/zephyr_gnu/samples/subsys/llext/shell_loader/sample.llext.shell/zephyr && /usr/bin/cmake -E true
collect2: error: ld returned 1 exit status
139s0
intel_adsp/cavs25/tgphsample.llext.shellerrorBuild failure - ld.bfd: warning: orphan section `.llext_heap' from `zephyr/subsys/llext/libsubsys__llext.a(llext_kheap.c.obj)' being placed in section `.llext_heap'
log
…u,_OffsetAbsSyms  -Wl,-u,_ConfigAbsSyms  -nostdlib  -static  -znoexecstack  -Wl,-X  -Wl,-N  -Wl,--orphan-handling=warn  -Wl,-no-pie  -Wl,--undefined=_sw_isr_table  -Wl,--undefined=_irq_vector_table  -specs=picolibc.specs  -DPICOLIBC_LONG_LONG_PRINTF_SCANF -L"/opt/toolchains/zephyr-sdk-1.0.1/gnu/xtensa-intel_tgl_adsp_zephyr-elf/bin/../lib/gcc/xtensa-intel_tgl_adsp_zephyr-elf/14.3.0/space" -lc -lgcc && cd /__w/zephyr/zephyr/twister-out/intel_adsp_cavs25_tgph/zephyr_gnu/samples/subsys/llext/shell_loader/sample.llext.shell/zephyr && /usr/bin/cmake -E true
collect2: error: ld returned 1 exit status
120s0
kit_pse84_ai/pse846gps2dbzc4a/m33arch.arm.sw_vector_relay.sram_vector_tableerrorBuild failure
log
…er/mcuboot/scripts/imgtool.py sign --version 0.0.0+0 --header-size 0x400 --erased-val 0xff --slot-size 0x200000 --hex-addr 0x70100000 /__w/zephyr/zephyr/twister-out/kit_pse84_ai_pse846gps2dbzc4a_m33/zephyr_gnu/tests/arch/arm/arm_sw_vector_relay/arch.arm.sw_vector_relay.sram_vector_table/arm_sw_vector_relay/zephyr/zephyr.hex /__w/zephyr/zephyr/twister-out/kit_pse84_ai_pse846gps2dbzc4a_m33/zephyr_gnu/tests/arch/arm/arm_sw_vector_relay/arch.arm.sw_vector_relay.sram_vector_table/arm_sw_vector_relay/zephyr/zephyr.signed.hex
Error: Header padding was not requested and image does not start with zeros
225s0
kit_pse84_ai/pse846gps2dbzc4a/m33drivers.mbox.mbox_dataerrorCMake build failure - CMake Error at /__w/zephyr/zephyr/tests/drivers/mbox/mbox_data/sysbuild.cmake:6 (message): Target kit_pse84_ai not supported for this sample. There is no remote
log
CMake Error at /__w/zephyr/zephyr/tests/drivers/mbox/mbox_data/sysbuild.cmake:6 (message):
7s0
kit_pse84_ai/pse846gps2dbzc4a/m33/nsdrivers.mbox.mbox_dataerrorCMake build failure - CMake Error at /__w/zephyr/zephyr/tests/drivers/mbox/mbox_data/sysbuild.cmake:6 (message): Target kit_pse84_ai not supported for this sample. There is no remote
log
CMake Error at /__w/zephyr/zephyr/tests/drivers/mbox/mbox_data/sysbuild.cmake:6 (message):
6s0
kit_pse84_ai/pse846gps2dbzc4a/m55drivers.mbox.mbox_dataerrorCMake build failure - CMake Error at /__w/zephyr/zephyr/tests/drivers/mbox/mbox_data/sysbuild.cmake:6 (message): Target kit_pse84_ai not supported for this sample. There is no remote
log
CMake Error at /__w/zephyr/zephyr/tests/drivers/mbox/mbox_data/sysbuild.cmake:6 (message):
6s0
kit_pse84_eval/pse846gps2dbzc4a/m33arch.arm.sw_vector_relay.sram_vector_tableerrorBuild failure
log
…cuboot/scripts/imgtool.py sign --version 0.0.0+0 --header-size 0x400 --erased-val 0xff --slot-size 0x240000 --hex-addr 0x70100000 /__w/zephyr/zephyr/twister-out/kit_pse84_eval_pse846gps2dbzc4a_m33/zephyr_gnu/tests/arch/arm/arm_sw_vector_relay/arch.arm.sw_vector_relay.sram_vector_table/arm_sw_vector_relay/zephyr/zephyr.hex /__w/zephyr/zephyr/twister-out/kit_pse84_eval_pse846gps2dbzc4a_m33/zephyr_gnu/tests/arch/arm/arm_sw_vector_relay/arch.arm.sw_vector_relay.sram_vector_table/arm_sw_vector_relay/zephyr/zephyr.signed.hex
Error: Header padding was not requested and image does not start with zeros
224s0
kit_pse84_eval/pse846gps2dbzc4a/m33drivers.mbox.mbox_dataerrorCMake build failure - CMake Error at /__w/zephyr/zephyr/tests/drivers/mbox/mbox_data/sysbuild.cmake:6 (message): Target kit_pse84_eval not supported for this sample. There is no remote
log
CMake Error at /__w/zephyr/zephyr/tests/drivers/mbox/mbox_data/sysbuild.cmake:6 (message):
7s0
kit_pse84_eval/pse846gps2dbzc4a/m33/nsdrivers.mbox.mbox_dataerrorCMake build failure - CMake Error at /__w/zephyr/zephyr/tests/drivers/mbox/mbox_data/sysbuild.cmake:6 (message): Target kit_pse84_eval not supported for this sample. There is no remote
log
CMake Error at /__w/zephyr/zephyr/tests/drivers/mbox/mbox_data/sysbuild.cmake:6 (message):
6s0
kit_pse84_eval/pse846gps2dbzc4a/m55drivers.mbox.mbox_dataerrorCMake build failure - CMake Error at /__w/zephyr/zephyr/tests/drivers/mbox/mbox_data/sysbuild.cmake:6 (message): Target kit_pse84_eval not supported for this sample. There is no remote
log
CMake Error at /__w/zephyr/zephyr/tests/drivers/mbox/mbox_data/sysbuild.cmake:6 (message):
6s0
lp_em_cc2340r5/cc2340r5arch.arm.irq_vector_tableerrorBuild failure - undefined reference to `arch_irq_connect_dynamic'
log
…irq_vector_table/zephyr/zephyr.elf && /opt/python/venv/bin/python3 /__w/zephyr/zephyr/soc/ti/simplelink/cc23x0/ti_ccfg_crc32_calculate.py /__w/zephyr/zephyr/twister-out/lp_em_cc2340r5_cc2340r5/zephyr_gnu/tests/arch/arm/arm_irq_vector_table/arch.arm.irq_vector_table/zephyr/zephyr.hex /__w/zephyr/zephyr/twister-out/lp_em_cc2340r5_cc2340r5/zephyr_gnu/tests/arch/arm/arm_irq_vector_table/arch.arm.irq_vector_table/zephyr/zephyr_crc32.hex
/__w/zephyr/zephyr/include/zephyr/irq.h:71:(.text.HwiP_construct+0x80): undefined reference to `arch_irq_connect_dynamic'
collect2: error: ld returned 1 exit status
122s0
lyra_24_dvk_p10/bgm240pb22vnamgmt.mcumgr.os.info.bterrorCMake build failure - CMake Error at /__w/zephyr/zephyr/cmake/modules/extensions.cmake:2482 (message): Blob for path
log
CMake Error at /__w/zephyr/zephyr/cmake/modules/extensions.cmake:2482 (message):
6s0
lyra_24_dvk_p20/bgm240pb32vnamgmt.mcumgr.os.info.bterrorCMake build failure - CMake Error at /__w/zephyr/zephyr/cmake/modules/extensions.cmake:2482 (message): Blob for path
log
CMake Error at /__w/zephyr/zephyr/cmake/modules/extensions.cmake:2482 (message):
6s0
lyra_24_dvk_p20rf/bgm240pb32vnnmgmt.mcumgr.os.info.bterrorCMake build failure - CMake Error at /__w/zephyr/zephyr/cmake/modules/extensions.cmake:2482 (message): Blob for path
log
CMake Error at /__w/zephyr/zephyr/cmake/modules/extensions.cmake:2482 (message):
6s0
lyra_24_dvk_s10/bgm240sb22vnamgmt.mcumgr.os.info.bterrorCMake build failure - CMake Error at /__w/zephyr/zephyr/cmake/modules/extensions.cmake:2482 (message): Blob for path
log
CMake Error at /__w/zephyr/zephyr/cmake/modules/extensions.cmake:2482 (message):
7s0
lyra_dvk_p/bgm220pc22hnamgmt.mcumgr.os.info.bterrorCMake build failure - CMake Error at /__w/zephyr/zephyr/cmake/modules/extensions.cmake:2482 (message): Blob for path
log
CMake Error at /__w/zephyr/zephyr/cmake/modules/extensions.cmake:2482 (message):
6s0
lyra_dvk_s/bgm220sc22hnamgmt.mcumgr.os.info.bterrorCMake build failure - CMake Error at /__w/zephyr/zephyr/cmake/modules/extensions.cmake:2482 (message): Blob for path
log
CMake Error at /__w/zephyr/zephyr/cmake/modules/extensions.cmake:2482 (message):
6s0
mgm260p_ek2713a/mgm260pd32vnamgmt.mcumgr.os.info.bterrorCMake build failure - CMake Error at /__w/zephyr/zephyr/cmake/modules/extensions.cmake:2482 (message): Blob for path
log
CMake Error at /__w/zephyr/zephyr/cmake/modules/extensions.cmake:2482 (message):
7s0
mps2/an383llext.semihosterrorNot in testsuite platform allow list but is one of the integration platforms0s0
mps2/an521/cpu0llext.semihosterrorNot in testsuite platform allow list but is one of the integration platforms0s0
mps4/corstone315/fvp/nsarch.arm.swap.tzerrorBuild failure
log
…h/arm/arm_thread_swap_tz/arch.arm.swap.tz/tfm/api_ns/interface/src/tfm_ps_api.c /__w/zephyr/zephyr/twister-out/mps4_corstone315_fvp_ns/zephyr_gnu/tests/arch/arm/arm_thread_swap_tz/arch.arm.swap.tz/tfm/api_ns/interface/src/tfm_tz_psa_ns_api.c /__w/zephyr/zephyr/twister-out/mps4_corstone315_fvp_ns/zephyr_gnu/tests/arch/arm/arm_thread_swap_tz/arch.arm.swap.tz/tfm/api_ns/interface/src/tfm_ioctl_core_ns_api.c
cd /__w/zephyr/zephyr/twister-out/mps4_corstone315_fvp_ns/zephyr_gnu/tests/arch/arm/arm_thread_swap_tz/arch.arm.swap.tz/tfm && /usr/bin/cmake --build .
ninja: build stopped: subcommand failed.
66s0
mps4/corstone315/fvp/nsarch.arm.swap.tz_offerrorBuild failure
log
…_swap_tz/arch.arm.swap.tz_off/tfm/api_ns/interface/src/tfm_ps_api.c /__w/zephyr/zephyr/twister-out/mps4_corstone315_fvp_ns/zephyr_gnu/tests/arch/arm/arm_thread_swap_tz/arch.arm.swap.tz_off/tfm/api_ns/interface/src/tfm_tz_psa_ns_api.c /__w/zephyr/zephyr/twister-out/mps4_corstone315_fvp_ns/zephyr_gnu/tests/arch/arm/arm_thread_swap_tz/arch.arm.swap.tz_off/tfm/api_ns/interface/src/tfm_ioctl_core_ns_api.c
cd /__w/zephyr/zephyr/twister-out/mps4_corstone315_fvp_ns/zephyr_gnu/tests/arch/arm/arm_thread_swap_tz/arch.arm.swap.tz_off/tfm && /usr/bin/cmake --build .
ninja: build stopped: subcommand failed.
61s0
mps4/corstone315/fvp/nssettings.functional.tfm-itserrorBuild failure
log
…nterface/src/tfm_ps_api.c /__w/zephyr/zephyr/twister-out/mps4_corstone315_fvp_ns/zephyr_gnu/tests/subsys/settings/functional/tfm_psa/settings.functional.tfm-its/tfm/api_ns/interface/src/tfm_tz_psa_ns_api.c /__w/zephyr/zephyr/twister-out/mps4_corstone315_fvp_ns/zephyr_gnu/tests/subsys/settings/functional/tfm_psa/settings.functional.tfm-its/tfm/api_ns/interface/src/tfm_ioctl_core_ns_api.c
cd /__w/zephyr/zephyr/twister-out/mps4_corstone315_fvp_ns/zephyr_gnu/tests/subsys/settings/functional/tfm_psa/settings.functional.tfm-its/tfm && /usr/bin/cmake --build .
ninja: build stopped: subcommand failed.
52s0
mps4/corstone315/fvp/nssettings.functional.tfm-pserrorBuild failure
log
…s/interface/src/tfm_ps_api.c /__w/zephyr/zephyr/twister-out/mps4_corstone315_fvp_ns/zephyr_gnu/tests/subsys/settings/functional/tfm_psa/settings.functional.tfm-ps/tfm/api_ns/interface/src/tfm_tz_psa_ns_api.c /__w/zephyr/zephyr/twister-out/mps4_corstone315_fvp_ns/zephyr_gnu/tests/subsys/settings/functional/tfm_psa/settings.functional.tfm-ps/tfm/api_ns/interface/src/tfm_ioctl_core_ns_api.c
cd /__w/zephyr/zephyr/twister-out/mps4_corstone315_fvp_ns/zephyr_gnu/tests/subsys/settings/functional/tfm_psa/settings.functional.tfm-ps/tfm && /usr/bin/cmake --build .
ninja: build stopped: subcommand failed.
95s0
mps4/corstone315/fvp/nssettings.tfm_psa_itserrorBuild failure
log
…sys/settings/tfm_psa/settings.tfm_psa_its/tfm/api_ns/interface/src/tfm_ps_api.c /__w/zephyr/zephyr/twister-out/mps4_corstone315_fvp_ns/zephyr_gnu/tests/subsys/settings/tfm_psa/settings.tfm_psa_its/tfm/api_ns/interface/src/tfm_tz_psa_ns_api.c /__w/zephyr/zephyr/twister-out/mps4_corstone315_fvp_ns/zephyr_gnu/tests/subsys/settings/tfm_psa/settings.tfm_psa_its/tfm/api_ns/interface/src/tfm_ioctl_core_ns_api.c
cd /__w/zephyr/zephyr/twister-out/mps4_corstone315_fvp_ns/zephyr_gnu/tests/subsys/settings/tfm_psa/settings.tfm_psa_its/tfm && /usr/bin/cmake --build .
ninja: build stopped: subcommand failed.
55s0
mps4/corstone315/fvp/nssettings.tfm_psa_pserrorBuild failure
log
…/subsys/settings/tfm_psa/settings.tfm_psa_ps/tfm/api_ns/interface/src/tfm_ps_api.c /__w/zephyr/zephyr/twister-out/mps4_corstone315_fvp_ns/zephyr_gnu/tests/subsys/settings/tfm_psa/settings.tfm_psa_ps/tfm/api_ns/interface/src/tfm_tz_psa_ns_api.c /__w/zephyr/zephyr/twister-out/mps4_corstone315_fvp_ns/zephyr_gnu/tests/subsys/settings/tfm_psa/settings.tfm_psa_ps/tfm/api_ns/interface/src/tfm_ioctl_core_ns_api.c
cd /__w/zephyr/zephyr/twister-out/mps4_corstone315_fvp_ns/zephyr_gnu/tests/subsys/settings/tfm_psa/settings.tfm_psa_ps/tfm && /usr/bin/cmake --build .
ninja: build stopped: subcommand failed.
69s0
mps4/corstone315/fvp/nstfm.regression.ipc.lvl1errorBuild failure
log
…gression/tfm.regression.ipc.lvl1/tfm/api_ns/interface/src/tfm_ps_api.c /__w/zephyr/zephyr/twister-out/mps4_corstone315_fvp_ns/zephyr_gnu/tests/modules/tf-m/regression/tfm.regression.ipc.lvl1/tfm/api_ns/interface/src/tfm_tz_psa_ns_api.c /__w/zephyr/zephyr/twister-out/mps4_corstone315_fvp_ns/zephyr_gnu/tests/modules/tf-m/regression/tfm.regression.ipc.lvl1/tfm/api_ns/interface/src/tfm_ioctl_core_ns_api.c
cd /__w/zephyr/zephyr/twister-out/mps4_corstone315_fvp_ns/zephyr_gnu/tests/modules/tf-m/regression/tfm.regression.ipc.lvl1/tfm && /usr/bin/cmake --build .
ninja: build stopped: subcommand failed.
84s0
mps4/corstone315/fvp/nstfm.regression.ipc.lvl2errorBuild failure
log
…gression/tfm.regression.ipc.lvl2/tfm/api_ns/interface/src/tfm_ps_api.c /__w/zephyr/zephyr/twister-out/mps4_corstone315_fvp_ns/zephyr_gnu/tests/modules/tf-m/regression/tfm.regression.ipc.lvl2/tfm/api_ns/interface/src/tfm_tz_psa_ns_api.c /__w/zephyr/zephyr/twister-out/mps4_corstone315_fvp_ns/zephyr_gnu/tests/modules/tf-m/regression/tfm.regression.ipc.lvl2/tfm/api_ns/interface/src/tfm_ioctl_core_ns_api.c
cd /__w/zephyr/zephyr/twister-out/mps4_corstone315_fvp_ns/zephyr_gnu/tests/modules/tf-m/regression/tfm.regression.ipc.lvl2/tfm && /usr/bin/cmake --build .
ninja: build stopped: subcommand failed.
70s0
mps4/corstone315/fvp/nstfm.regression.sfnerrorBuild failure
log
…ests/modules/tf-m/regression/tfm.regression.sfn/tfm/api_ns/interface/src/tfm_ps_api.c /__w/zephyr/zephyr/twister-out/mps4_corstone315_fvp_ns/zephyr_gnu/tests/modules/tf-m/regression/tfm.regression.sfn/tfm/api_ns/interface/src/tfm_tz_psa_ns_api.c /__w/zephyr/zephyr/twister-out/mps4_corstone315_fvp_ns/zephyr_gnu/tests/modules/tf-m/regression/tfm.regression.sfn/tfm/api_ns/interface/src/tfm_ioctl_core_ns_api.c
cd /__w/zephyr/zephyr/twister-out/mps4_corstone315_fvp_ns/zephyr_gnu/tests/modules/tf-m/regression/tfm.regression.sfn/tfm && /usr/bin/cmake --build .
ninja: build stopped: subcommand failed.
28s0
mps4/corstone320/fvp/nsarch.arm.swap.tzerrorBuild failure
log
…h/arm/arm_thread_swap_tz/arch.arm.swap.tz/tfm/api_ns/interface/src/tfm_ps_api.c /__w/zephyr/zephyr/twister-out/mps4_corstone320_fvp_ns/zephyr_gnu/tests/arch/arm/arm_thread_swap_tz/arch.arm.swap.tz/tfm/api_ns/interface/src/tfm_tz_psa_ns_api.c /__w/zephyr/zephyr/twister-out/mps4_corstone320_fvp_ns/zephyr_gnu/tests/arch/arm/arm_thread_swap_tz/arch.arm.swap.tz/tfm/api_ns/interface/src/tfm_ioctl_core_ns_api.c
cd /__w/zephyr/zephyr/twister-out/mps4_corstone320_fvp_ns/zephyr_gnu/tests/arch/arm/arm_thread_swap_tz/arch.arm.swap.tz/tfm && /usr/bin/cmake --build .
ninja: build stopped: subcommand failed.
78s0
mps4/corstone320/fvp/nsarch.arm.swap.tz_offerrorBuild failure
log
…_swap_tz/arch.arm.swap.tz_off/tfm/api_ns/interface/src/tfm_ps_api.c /__w/zephyr/zephyr/twister-out/mps4_corstone320_fvp_ns/zephyr_gnu/tests/arch/arm/arm_thread_swap_tz/arch.arm.swap.tz_off/tfm/api_ns/interface/src/tfm_tz_psa_ns_api.c /__w/zephyr/zephyr/twister-out/mps4_corstone320_fvp_ns/zephyr_gnu/tests/arch/arm/arm_thread_swap_tz/arch.arm.swap.tz_off/tfm/api_ns/interface/src/tfm_ioctl_core_ns_api.c
cd /__w/zephyr/zephyr/twister-out/mps4_corstone320_fvp_ns/zephyr_gnu/tests/arch/arm/arm_thread_swap_tz/arch.arm.swap.tz_off/tfm && /usr/bin/cmake --build .
ninja: build stopped: subcommand failed.
60s0
mps4/corstone320/fvp/nssettings.functional.tfm-itserrorBuild failure
log
…nterface/src/tfm_ps_api.c /__w/zephyr/zephyr/twister-out/mps4_corstone320_fvp_ns/zephyr_gnu/tests/subsys/settings/functional/tfm_psa/settings.functional.tfm-its/tfm/api_ns/interface/src/tfm_tz_psa_ns_api.c /__w/zephyr/zephyr/twister-out/mps4_corstone320_fvp_ns/zephyr_gnu/tests/subsys/settings/functional/tfm_psa/settings.functional.tfm-its/tfm/api_ns/interface/src/tfm_ioctl_core_ns_api.c
cd /__w/zephyr/zephyr/twister-out/mps4_corstone320_fvp_ns/zephyr_gnu/tests/subsys/settings/functional/tfm_psa/settings.functional.tfm-its/tfm && /usr/bin/cmake --build .
ninja: build stopped: subcommand failed.
52s0
mps4/corstone320/fvp/nssettings.functional.tfm-pserrorBuild failure
log
…s/interface/src/tfm_ps_api.c /__w/zephyr/zephyr/twister-out/mps4_corstone320_fvp_ns/zephyr_gnu/tests/subsys/settings/functional/tfm_psa/settings.functional.tfm-ps/tfm/api_ns/interface/src/tfm_tz_psa_ns_api.c /__w/zephyr/zephyr/twister-out/mps4_corstone320_fvp_ns/zephyr_gnu/tests/subsys/settings/functional/tfm_psa/settings.functional.tfm-ps/tfm/api_ns/interface/src/tfm_ioctl_core_ns_api.c
cd /__w/zephyr/zephyr/twister-out/mps4_corstone320_fvp_ns/zephyr_gnu/tests/subsys/settings/functional/tfm_psa/settings.functional.tfm-ps/tfm && /usr/bin/cmake --build .
ninja: build stopped: subcommand failed.
114s0
mps4/corstone320/fvp/nssettings.tfm_psa_itserrorBuild failure
log
…sys/settings/tfm_psa/settings.tfm_psa_its/tfm/api_ns/interface/src/tfm_ps_api.c /__w/zephyr/zephyr/twister-out/mps4_corstone320_fvp_ns/zephyr_gnu/tests/subsys/settings/tfm_psa/settings.tfm_psa_its/tfm/api_ns/interface/src/tfm_tz_psa_ns_api.c /__w/zephyr/zephyr/twister-out/mps4_corstone320_fvp_ns/zephyr_gnu/tests/subsys/settings/tfm_psa/settings.tfm_psa_its/tfm/api_ns/interface/src/tfm_ioctl_core_ns_api.c
cd /__w/zephyr/zephyr/twister-out/mps4_corstone320_fvp_ns/zephyr_gnu/tests/subsys/settings/tfm_psa/settings.tfm_psa_its/tfm && /usr/bin/cmake --build .
ninja: build stopped: subcommand failed.
55s0
mps4/corstone320/fvp/nssettings.tfm_psa_pserrorBuild failure
log
…/subsys/settings/tfm_psa/settings.tfm_psa_ps/tfm/api_ns/interface/src/tfm_ps_api.c /__w/zephyr/zephyr/twister-out/mps4_corstone320_fvp_ns/zephyr_gnu/tests/subsys/settings/tfm_psa/settings.tfm_psa_ps/tfm/api_ns/interface/src/tfm_tz_psa_ns_api.c /__w/zephyr/zephyr/twister-out/mps4_corstone320_fvp_ns/zephyr_gnu/tests/subsys/settings/tfm_psa/settings.tfm_psa_ps/tfm/api_ns/interface/src/tfm_ioctl_core_ns_api.c
cd /__w/zephyr/zephyr/twister-out/mps4_corstone320_fvp_ns/zephyr_gnu/tests/subsys/settings/tfm_psa/settings.tfm_psa_ps/tfm && /usr/bin/cmake --build .
ninja: build stopped: subcommand failed.
69s0
mps4/corstone320/fvp/nstfm.regression.ipc.lvl1errorBuild failure
log
…gression/tfm.regression.ipc.lvl1/tfm/api_ns/interface/src/tfm_ps_api.c /__w/zephyr/zephyr/twister-out/mps4_corstone320_fvp_ns/zephyr_gnu/tests/modules/tf-m/regression/tfm.regression.ipc.lvl1/tfm/api_ns/interface/src/tfm_tz_psa_ns_api.c /__w/zephyr/zephyr/twister-out/mps4_corstone320_fvp_ns/zephyr_gnu/tests/modules/tf-m/regression/tfm.regression.ipc.lvl1/tfm/api_ns/interface/src/tfm_ioctl_core_ns_api.c
cd /__w/zephyr/zephyr/twister-out/mps4_corstone320_fvp_ns/zephyr_gnu/tests/modules/tf-m/regression/tfm.regression.ipc.lvl1/tfm && /usr/bin/cmake --build .
ninja: build stopped: subcommand failed.
79s0
mps4/corstone320/fvp/nstfm.regression.ipc.lvl2errorBuild failure
log
…gression/tfm.regression.ipc.lvl2/tfm/api_ns/interface/src/tfm_ps_api.c /__w/zephyr/zephyr/twister-out/mps4_corstone320_fvp_ns/zephyr_gnu/tests/modules/tf-m/regression/tfm.regression.ipc.lvl2/tfm/api_ns/interface/src/tfm_tz_psa_ns_api.c /__w/zephyr/zephyr/twister-out/mps4_corstone320_fvp_ns/zephyr_gnu/tests/modules/tf-m/regression/tfm.regression.ipc.lvl2/tfm/api_ns/interface/src/tfm_ioctl_core_ns_api.c
cd /__w/zephyr/zephyr/twister-out/mps4_corstone320_fvp_ns/zephyr_gnu/tests/modules/tf-m/regression/tfm.regression.ipc.lvl2/tfm && /usr/bin/cmake --build .
ninja: build stopped: subcommand failed.
70s0
mps4/corstone320/fvp/nstfm.regression.sfnerrorBuild failure
log
…ests/modules/tf-m/regression/tfm.regression.sfn/tfm/api_ns/interface/src/tfm_ps_api.c /__w/zephyr/zephyr/twister-out/mps4_corstone320_fvp_ns/zephyr_gnu/tests/modules/tf-m/regression/tfm.regression.sfn/tfm/api_ns/interface/src/tfm_tz_psa_ns_api.c /__w/zephyr/zephyr/twister-out/mps4_corstone320_fvp_ns/zephyr_gnu/tests/modules/tf-m/regression/tfm.regression.sfn/tfm/api_ns/interface/src/tfm_ioctl_core_ns_api.c
cd /__w/zephyr/zephyr/twister-out/mps4_corstone320_fvp_ns/zephyr_gnu/tests/modules/tf-m/regression/tfm.regression.sfn/tfm && /usr/bin/cmake --build .
ninja: build stopped: subcommand failed.
28s0
mr_mcxn_t1/mcxn947/cpu1drivers.can.shellerrorBuild failure - error: '__device_dts_ord_65' undeclared here (not in a function); did you mean '__device_dts_ord_68'?
log
[74/195] Building C object zephyr/arch/arch/arm/core/CMakeFiles/arch__arm__core.dir/fatal.c.obj
/__w/zephyr/zephyr/include/zephyr/device.h:102:41: error: '__device_dts_ord_65' undeclared here (not in a function); did you mean '__device_dts_ord_68'?
135s0
mr_mcxn_t1/mcxn947/cpu1drivers.sensor.shellerrorBuild failure - error: '__device_dts_ord_178' undeclared here (not in a function); did you mean '__device_dts_ord_18'?
log
[75/205] Building C object zephyr/arch/arch/arm/core/CMakeFiles/arch__arm__core.dir/fatal.c.obj
/__w/zephyr/zephyr/include/zephyr/device.h:102:41: error: '__device_dts_ord_178' undeclared here (not in a function); did you mean '__device_dts_ord_18'?
/__w/zephyr/zephyr/include/zephyr/device.h:102:41: error: '__device_dts_ord_177' undeclared here (not in a function); did you mean '__device_dts_ord_17'?
156s0
mr_mcxn_t1/mcxn947/cpu1sample.net.sockets.dumb_http_servererrorBuild failure - error: '__device_dts_ord_132' undeclared here (not in a function); did you mean '__device_dts_ord_13'?
log
[59/262] Building C object zephyr/arch/arch/arm/core/CMakeFiles/arch__arm__core.dir/fatal.c.obj
/__w/zephyr/zephyr/include/zephyr/device.h:102:41: error: '__device_dts_ord_132' undeclared here (not in a function); did you mean '__device_dts_ord_13'?
/__w/zephyr/zephyr/include/zephyr/device.h:102:41: error: '__device_dts_ord_131' undeclared here (not in a function); did you mean '__device_dts_ord_13'?
88s0
mr_mcxn_t1/mcxn947/cpu1sample.posix.gettimeofdayerrorBuild failure - error: '__device_dts_ord_132' undeclared here (not in a function); did you mean '__device_dts_ord_13'?
log
[58/282] Building C object zephyr/arch/arch/arm/core/CMakeFiles/arch__arm__core.dir/fatal.c.obj
/__w/zephyr/zephyr/include/zephyr/device.h:102:41: error: '__device_dts_ord_132' undeclared here (not in a function); did you mean '__device_dts_ord_13'?
/__w/zephyr/zephyr/include/zephyr/device.h:102:41: error: '__device_dts_ord_131' undeclared here (not in a function); did you mean '__device_dts_ord_13'?
165s0
nrf52_bsim/nativefilesystem.lib_linkerrorBuild failure - undefined reference to `log_const_littlefs'
log
…/zephyr/twister-out/nrf52_bsim_native/host_gnu/tests/subsys/fs/lib_link/filesystem.lib_link/zephyr/NSI/__w/zephyr/zephyr/twister-out/nrf52_bsim_native/host_gnu/tests/subsys/fs/lib_link/filesystem.lib_link/zephyr/zephyr.elf.loc_cpusw.o:/__w/zephyr/modules/fs/littlefs/lfs.c:13:(.data.__log_current_const_data+0x14): undefined reference to `log_const_littlefs'
collect2: error: ld returned 1 exit status
make: *** [/__w/zephyr/zephyr/scripts/native_simulator/Makefile:142: /__w/zephyr/zephyr/twister-out/nrf52_bsim_native/host_gnu/tests/subsys/fs/lib_link/filesystem.lib_link/zephyr/zephyr.exe] Error 1
88s0
nrf5340bsim/nrf5340/cpuappfilesystem.lib_linkerrorBuild failure - undefined reference to `log_const_littlefs'
log
…bsim_nrf5340_cpuapp/host_gnu/tests/subsys/fs/lib_link/filesystem.lib_link/zephyr/NSI/__w/zephyr/zephyr/twister-out/nrf5340bsim_nrf5340_cpuapp/host_gnu/tests/subsys/fs/lib_link/filesystem.lib_link/zephyr/zephyr.elf.loc_cpusw.o:/__w/zephyr/modules/fs/littlefs/lfs.c:13:(.data.__log_current_const_data+0x14): undefined reference to `log_const_littlefs'
collect2: error: ld returned 1 exit status
make: *** [/__w/zephyr/zephyr/scripts/native_simulator/Makefile:142: /__w/zephyr/zephyr/twister-out/nrf5340bsim_nrf5340_cpuapp/host_gnu/tests/subsys/fs/lib_link/filesystem.lib_link/zephyr/zephyr.exe] Error 1
100s0
nrf5340bsim/nrf5340/cpunetfilesystem.lib_linkerrorBuild failure - undefined reference to `log_const_littlefs'
log
…bsim_nrf5340_cpunet/host_gnu/tests/subsys/fs/lib_link/filesystem.lib_link/zephyr/NSI/__w/zephyr/zephyr/twister-out/nrf5340bsim_nrf5340_cpunet/host_gnu/tests/subsys/fs/lib_link/filesystem.lib_link/zephyr/zephyr.elf.loc_cpusw.o:/__w/zephyr/modules/fs/littlefs/lfs.c:13:(.data.__log_current_const_data+0x14): undefined reference to `log_const_littlefs'
collect2: error: ld returned 1 exit status
make: *** [/__w/zephyr/zephyr/scripts/native_simulator/Makefile:142: /__w/zephyr/zephyr/twister-out/nrf5340bsim_nrf5340_cpunet/host_gnu/tests/subsys/fs/lib_link/filesystem.lib_link/zephyr/zephyr.exe] Error 1
98s0
nrf54l15bsim/nrf54l15/cpuappfilesystem.lib_linkerrorBuild failure - undefined reference to `log_const_littlefs'
log
…nrf54l15_cpuapp/host_gnu/tests/subsys/fs/lib_link/filesystem.lib_link/zephyr/NSI/__w/zephyr/zephyr/twister-out/nrf54l15bsim_nrf54l15_cpuapp/host_gnu/tests/subsys/fs/lib_link/filesystem.lib_link/zephyr/zephyr.elf.loc_cpusw.o:/__w/zephyr/modules/fs/littlefs/lfs.c:13:(.data.__log_current_const_data+0x14): undefined reference to `log_const_littlefs'
collect2: error: ld returned 1 exit status
make: *** [/__w/zephyr/zephyr/scripts/native_simulator/Makefile:142: /__w/zephyr/zephyr/twister-out/nrf54l15bsim_nrf54l15_cpuapp/host_gnu/tests/subsys/fs/lib_link/filesystem.lib_link/zephyr/zephyr.exe] Error 1
96s0
nrf54l15dk/nrf54l10/cpuflprarch.interrupt.minimallibcerrorBuild failure - in function `sys_clock_driver_init':
log
…--sort-section=alignment  -Wl,-u,_OffsetAbsSyms  -Wl,-u,_ConfigAbsSyms  -nostdlib  -static  -znoexecstack  -Wl,-X  -Wl,-N  -Wl,--orphan-handling=warn  -Wl,-no-pie  -Wl,--undefined=_sw_isr_table  -Wl,--undefined=_irq_vector_table -L"/opt/toolchains/zephyr-sdk-1.0.1/gnu/riscv64-zephyr-elf/bin/../lib/gcc/riscv64-zephyr-elf/14.3.0/rv32emc_zicsr_zcb_zba_zbb_zbc_zbs/ilp32e/space"  -lgcc && cd /__w/zephyr/zephyr/twister-out/nrf54l15dk_nrf54l10_cpuflpr/zephyr_gnu/tests/arch/common/interrupt/arch.interrupt.minimallibc/interrupt/zephyr && /usr/bin/cmake -E true
collect2: error: ld returned 1 exit status
129s0
nrf54l15dk/nrf54l15/cpuflprarch.interrupt.minimallibcerrorBuild failure - in function `sys_clock_driver_init':
log
…--sort-section=alignment  -Wl,-u,_OffsetAbsSyms  -Wl,-u,_ConfigAbsSyms  -nostdlib  -static  -znoexecstack  -Wl,-X  -Wl,-N  -Wl,--orphan-handling=warn  -Wl,-no-pie  -Wl,--undefined=_sw_isr_table  -Wl,--undefined=_irq_vector_table -L"/opt/toolchains/zephyr-sdk-1.0.1/gnu/riscv64-zephyr-elf/bin/../lib/gcc/riscv64-zephyr-elf/14.3.0/rv32emc_zicsr_zcb_zba_zbb_zbc_zbs/ilp32e/space"  -lgcc && cd /__w/zephyr/zephyr/twister-out/nrf54l15dk_nrf54l15_cpuflpr/zephyr_gnu/tests/arch/common/interrupt/arch.interrupt.minimallibc/interrupt/zephyr && /usr/bin/cmake -E true
collect2: error: ld returned 1 exit status
145s0
nrf54l15tag/nrf54l15/cpuappdrivers.sensor.shellerrorBuild failure - error: data definition has no type or storage class [-Werror]
log
…bj
/__w/zephyr/zephyr/drivers/sensor/bosch/bme680/bme680.c:520:9: error: data definition has no type or storage class [-Werror]
/__w/zephyr/zephyr/drivers/sensor/bosch/bme680/bme680.c:520:9: error: type defaults to 'int' in declaration of 'I2C_DT_IODEV_DEFINE' [-Wimplicit-int]
/__w/zephyr/zephyr/drivers/sensor/bosch/bme680/bme680.c:558:23: error: parameter names (without types) in function declaration [-Wdeclaration-missing-parameter-type]
/__w/zephyr/zephyr/drivers/sensor/bosch/bme680/bme680.c:530:23: error: 'bme680_iodev_0' undeclared here (not in a function); did you mean 'bme680_config_0'?
166s0
nrf54l15tag/nrf54l15/cpuapp/nsdrivers.sensor.shellerrorBuild failure - error: data definition has no type or storage class [-Werror]
log
…bj
/__w/zephyr/zephyr/drivers/sensor/bosch/bme680/bme680.c:520:9: error: data definition has no type or storage class [-Werror]
/__w/zephyr/zephyr/drivers/sensor/bosch/bme680/bme680.c:520:9: error: type defaults to 'int' in declaration of 'I2C_DT_IODEV_DEFINE' [-Wimplicit-int]
/__w/zephyr/zephyr/drivers/sensor/bosch/bme680/bme680.c:558:23: error: parameter names (without types) in function declaration [-Wdeclaration-missing-parameter-type]
/__w/zephyr/zephyr/drivers/sensor/bosch/bme680/bme680.c:530:23: error: 'bme680_iodev_0' undeclared here (not in a function); did you mean 'bme680_config_0'?
232s0
nrf54lm20bsim/nrf54lm20a/cpuappfilesystem.lib_linkerrorBuild failure - undefined reference to `log_const_littlefs'
log
…0a_cpuapp/host_gnu/tests/subsys/fs/lib_link/filesystem.lib_link/zephyr/NSI/__w/zephyr/zephyr/twister-out/nrf54lm20bsim_nrf54lm20a_cpuapp/host_gnu/tests/subsys/fs/lib_link/filesystem.lib_link/zephyr/zephyr.elf.loc_cpusw.o:/__w/zephyr/modules/fs/littlefs/lfs.c:13:(.data.__log_current_const_data+0x18): undefined reference to `log_const_littlefs'
collect2: error: ld returned 1 exit status
make: *** [/__w/zephyr/zephyr/scripts/native_simulator/Makefile:142: /__w/zephyr/zephyr/twister-out/nrf54lm20bsim_nrf54lm20a_cpuapp/host_gnu/tests/subsys/fs/lib_link/filesystem.lib_link/zephyr/zephyr.exe] Error 1
102s0
nrf9280pdk@0.2.0/nrf9280/cpuappdrivers.uart.basic_api.cdc_acmerrorBuild failure - error: 'USBHS_PHY_CONFIG_PLLITUNE_Pos' undeclared here (not in a function)
log
…/zephyr/zephyr/drivers/usb/udc/../common/nordic/nrf_usbhs_phy_config.h:25:42: error: 'USBHS_PHY_CONFIG_TXRESTUNE0_Pos' undeclared here (not in a function)
/__w/zephyr/zephyr/drivers/usb/udc/../common/nordic/nrf_usbhs_phy_config.h:26:48: error: 'USBHS_PHY_CONFIG_TXPREEMPAMPTUNE0_Pos' undeclared here (not in a function)
/__w/zephyr/zephyr/drivers/usb/udc/../common/nordic/nrf_usbhs_phy_config.h:27:50: error: 'USBHS_PHY_CONFIG_TXPREEMPPULSETUNE0_Pos' undeclared here (not in a function)
/__w/zephyr/zephyr/drivers/usb/udc/udc_dwc2_nrf_usbhs.h:106:16: error: 'NRF_USBHS_Type' has no member named 'PHY'
195s0
nrf9280pdk@0.2.0/nrf9280/cpuappdrivers.usb.udcerrorBuild failure - error: 'USBHS_PHY_CONFIG_PLLITUNE_Pos' undeclared here (not in a function)
log
…/zephyr/zephyr/drivers/usb/udc/../common/nordic/nrf_usbhs_phy_config.h:25:42: error: 'USBHS_PHY_CONFIG_TXRESTUNE0_Pos' undeclared here (not in a function)
/__w/zephyr/zephyr/drivers/usb/udc/../common/nordic/nrf_usbhs_phy_config.h:26:48: error: 'USBHS_PHY_CONFIG_TXPREEMPAMPTUNE0_Pos' undeclared here (not in a function)
/__w/zephyr/zephyr/drivers/usb/udc/../common/nordic/nrf_usbhs_phy_config.h:27:50: error: 'USBHS_PHY_CONFIG_TXPREEMPPULSETUNE0_Pos' undeclared here (not in a function)
/__w/zephyr/zephyr/drivers/usb/udc/udc_dwc2_nrf_usbhs.h:106:16: error: 'NRF_USBHS_Type' has no member named 'PHY'
121s0
nrf9280pdk@0.2.0/nrf9280/cpuappsample.usb.usb_device_next.midierrorBuild failure - error: 'USBHS_PHY_CONFIG_PLLITUNE_Pos' undeclared here (not in a function)
log
…/zephyr/zephyr/drivers/usb/udc/../common/nordic/nrf_usbhs_phy_config.h:25:42: error: 'USBHS_PHY_CONFIG_TXRESTUNE0_Pos' undeclared here (not in a function)
/__w/zephyr/zephyr/drivers/usb/udc/../common/nordic/nrf_usbhs_phy_config.h:26:48: error: 'USBHS_PHY_CONFIG_TXPREEMPAMPTUNE0_Pos' undeclared here (not in a function)
/__w/zephyr/zephyr/drivers/usb/udc/../common/nordic/nrf_usbhs_phy_config.h:27:50: error: 'USBHS_PHY_CONFIG_TXPREEMPPULSETUNE0_Pos' undeclared here (not in a function)
/__w/zephyr/zephyr/drivers/usb/udc/udc_dwc2_nrf_usbhs.h:106:16: error: 'NRF_USBHS_Type' has no member named 'PHY'
148s0
nrf9280pdk@0.2.0/nrf9280/cpuappsample.usbd.loopbackerrorBuild failure - error: 'USBHS_PHY_CONFIG_PLLITUNE_Pos' undeclared here (not in a function)
log
…/zephyr/zephyr/drivers/usb/udc/../common/nordic/nrf_usbhs_phy_config.h:25:42: error: 'USBHS_PHY_CONFIG_TXRESTUNE0_Pos' undeclared here (not in a function)
/__w/zephyr/zephyr/drivers/usb/udc/../common/nordic/nrf_usbhs_phy_config.h:26:48: error: 'USBHS_PHY_CONFIG_TXPREEMPAMPTUNE0_Pos' undeclared here (not in a function)
/__w/zephyr/zephyr/drivers/usb/udc/../common/nordic/nrf_usbhs_phy_config.h:27:50: error: 'USBHS_PHY_CONFIG_TXPREEMPPULSETUNE0_Pos' undeclared here (not in a function)
/__w/zephyr/zephyr/drivers/usb/udc/udc_dwc2_nrf_usbhs.h:106:16: error: 'NRF_USBHS_Type' has no member named 'PHY'
113s0
nrf93m1dk@0.4.0/nrf54l15/cpuappapplication_development.ram_context_for_isrerrorBuild failure - ld.bfd: warning: orphan section `.__device_deps_pass1' from `app/libapp.a(fake_driver.c.obj)' being placed in section `.__device_deps_pass1'
log
…ic  -znoexecstack  -Wl,-X  -Wl,-N  -Wl,--orphan-handling=warn  -Wl,-no-pie  -Wl,--undefined=_sw_isr_table  -Wl,--undefined=_irq_vector_table  -specs=picolibc.specs  -DPICOLIBC_LONG_LONG_PRINTF_SCANF -L"/opt/toolchains/zephyr-sdk-1.0.1/gnu/arm-zephyr-eabi/bin/../lib/gcc/arm-zephyr-eabi/14.3.0/thumb/v8-m.main/nofp/space" -lc -lgcc && cd /__w/zephyr/zephyr/twister-out/nrf93m1dk@0.4.0_nrf54l15_cpuapp/zephyr_gnu/tests/application_development/ram_context_for_isr/application_development.ram_context_for_isr/ram_context_for_isr/zephyr && /usr/bin/cmake -E true
collect2: error: ld returned 1 exit status
196s0
nrf93m1dk@0.4.0/nrf54l15/cpuapp/nsapplication_development.ram_context_for_isrerrorBuild failure - ld.bfd: warning: orphan section `.__device_deps_pass1' from `app/libapp.a(fake_driver.c.obj)' being placed in section `.__device_deps_pass1'
log
… -znoexecstack  -Wl,-X  -Wl,-N  -Wl,--orphan-handling=warn  -Wl,-no-pie  -Wl,--undefined=_sw_isr_table  -Wl,--undefined=_irq_vector_table  -specs=picolibc.specs  -DPICOLIBC_LONG_LONG_PRINTF_SCANF -L"/opt/toolchains/zephyr-sdk-1.0.1/gnu/arm-zephyr-eabi/bin/../lib/gcc/arm-zephyr-eabi/14.3.0/thumb/v8-m.main/nofp/space" -lc -lgcc && cd /__w/zephyr/zephyr/twister-out/nrf93m1dk@0.4.0_nrf54l15_cpuapp_ns/zephyr_gnu/tests/application_development/ram_context_for_isr/application_development.ram_context_for_isr/ram_context_for_isr/zephyr && /usr/bin/cmake -E true
collect2: error: ld returned 1 exit status
263s0
nucleo_wb05kz/stm32wb05mgmt.mcumgr.os.info.bterrorCMake build failure - CMake Error at /__w/zephyr/zephyr/cmake/modules/extensions.cmake:2482 (message): Blob for path
log
CMake Error at /__w/zephyr/zephyr/cmake/modules/extensions.cmake:2482 (message):
6s0
nucleo_wb07cc/stm32wb07mgmt.mcumgr.os.info.bterrorCMake build failure - CMake Error at /__w/zephyr/zephyr/cmake/modules/extensions.cmake:2482 (message): Blob for path
log
CMake Error at /__w/zephyr/zephyr/cmake/modules/extensions.cmake:2482 (message):
6s0
nucleo_wb09ke/stm32wb09mgmt.mcumgr.os.info.bterrorCMake build failure - CMake Error at /__w/zephyr/zephyr/cmake/modules/extensions.cmake:2482 (message): Blob for path
log
CMake Error at /__w/zephyr/zephyr/cmake/modules/extensions.cmake:2482 (message):
6s0
nucleo_wba25ce1/stm32wba25xxmgmt.mcumgr.os.info.bterrorCMake build failure - CMake Error at /__w/zephyr/zephyr/cmake/modules/extensions.cmake:2482 (message): Blob for path
log
CMake Error at /__w/zephyr/zephyr/cmake/modules/extensions.cmake:2482 (message):
6s0
pinnacle_100_dvk/nrf52840drivers.sensor.shellerrorBuild failure - error: data definition has no type or storage class [-Werror]
log
…bj
/__w/zephyr/zephyr/drivers/sensor/bosch/bme680/bme680.c:520:9: error: data definition has no type or storage class [-Werror]
/__w/zephyr/zephyr/drivers/sensor/bosch/bme680/bme680.c:520:9: error: type defaults to 'int' in declaration of 'I2C_DT_IODEV_DEFINE' [-Wimplicit-int]
/__w/zephyr/zephyr/drivers/sensor/bosch/bme680/bme680.c:558:23: error: parameter names (without types) in function declaration [-Wdeclaration-missing-parameter-type]
/__w/zephyr/zephyr/drivers/sensor/bosch/bme680/bme680.c:530:23: error: 'bme680_iodev_0' undeclared here (not in a function); did you mean 'bme680_config_0'?
124s0
qemu_cortex_a9/xc7z007sllext.semihosterrorNot in testsuite platform allow list but is one of the integration platforms0s0
qemu_cortex_r5/zynqmp_rpullext.semihosterrorNot in testsuite platform allow list but is one of the integration platforms0s0
quill_nrf52840_mesh/nrf52840application_development.ram_context_for_isrerrorBuild failure - ld.bfd: warning: orphan section `.__device_deps_pass1' from `app/libapp.a(fake_driver.c.obj)' being placed in section `.__device_deps_pass1'
log
…igAbsSyms  -nostdlib  -static  -znoexecstack  -Wl,-X  -Wl,-N  -Wl,--orphan-handling=warn  -Wl,-no-pie  -Wl,--undefined=_sw_isr_table  -Wl,--undefined=_irq_vector_table  -specs=picolibc.specs  -DPICOLIBC_LONG_LONG_PRINTF_SCANF -L"/opt/toolchains/zephyr-sdk-1.0.1/gnu/arm-zephyr-eabi/bin/../lib/gcc/arm-zephyr-eabi/14.3.0/thumb/v7e-m/nofp/space" -lc -lgcc && cd /__w/zephyr/zephyr/twister-out/quill_nrf52840_mesh_nrf52840/zephyr_gnu/tests/application_development/ram_context_for_isr/application_development.ram_context_for_isr/zephyr && /usr/bin/cmake -E true
collect2: error: ld returned 1 exit status
193s0
raytac_an54lq_db_15/nrf54l15/cpuflprarch.interrupt.minimallibcerrorBuild failure - in function `sys_clock_driver_init':
log
…ction=alignment  -Wl,-u,_OffsetAbsSyms  -Wl,-u,_ConfigAbsSyms  -nostdlib  -static  -znoexecstack  -Wl,-X  -Wl,-N  -Wl,--orphan-handling=warn  -Wl,-no-pie  -Wl,--undefined=_sw_isr_table  -Wl,--undefined=_irq_vector_table -L"/opt/toolchains/zephyr-sdk-1.0.1/gnu/riscv64-zephyr-elf/bin/../lib/gcc/riscv64-zephyr-elf/14.3.0/rv32emc_zicsr_zcb_zba_zbb_zbc_zbs/ilp32e/space"  -lgcc && cd /__w/zephyr/zephyr/twister-out/raytac_an54lq_db_15_nrf54l15_cpuflpr/zephyr_gnu/tests/arch/common/interrupt/arch.interrupt.minimallibc/interrupt/zephyr && /usr/bin/cmake -E true
collect2: error: ld returned 1 exit status
145s0
raytac_an54lv_db_15/nrf54l15/cpuflprarch.interrupt.minimallibcerrorBuild failure - in function `sys_clock_driver_init':
log
…ction=alignment  -Wl,-u,_OffsetAbsSyms  -Wl,-u,_ConfigAbsSyms  -nostdlib  -static  -znoexecstack  -Wl,-X  -Wl,-N  -Wl,--orphan-handling=warn  -Wl,-no-pie  -Wl,--undefined=_sw_isr_table  -Wl,--undefined=_irq_vector_table -L"/opt/toolchains/zephyr-sdk-1.0.1/gnu/riscv64-zephyr-elf/bin/../lib/gcc/riscv64-zephyr-elf/14.3.0/rv32emc_zicsr_zcb_zba_zbb_zbc_zbs/ilp32e/space"  -lgcc && cd /__w/zephyr/zephyr/twister-out/raytac_an54lv_db_15_nrf54l15_cpuflpr/zephyr_gnu/tests/arch/common/interrupt/arch.interrupt.minimallibc/interrupt/zephyr && /usr/bin/cmake -E true
collect2: error: ld returned 1 exit status
140s0
rock_5b_plus/rk3588/smpkernel.commonerrorBuild failure
log
[59/184] Building C object zephyr/arch/arch/arm64/core/CMakeFiles/arch__arm64__core.dir/fatal.c.obj
[127/184] Building C object zephyr/kernel/CMakeFiles/kernel.dir/fatal.c.obj
77s0
rock_5b_plus/rk3588/smpkernel.common.tlserrorBuild failure
log
[59/184] Building C object zephyr/arch/arch/arm64/core/CMakeFiles/arch__arm64__core.dir/fatal.c.obj
[127/184] Building C object zephyr/kernel/CMakeFiles/kernel.dir/fatal.c.obj
142s0
rock_5b_plus/rk3588/smpkernel.memory_protection.syscalls.kyielderrorBuild failure
log
[48/170] Building C object zephyr/arch/arch/arm64/core/CMakeFiles/arch__arm64__core.dir/fatal.c.obj
[115/170] Building C object zephyr/kernel/CMakeFiles/kernel.dir/fatal.c.obj
56s0
rock_5b_plus/rk3588/smpkernel.memory_protection.syscalls.timeslicingerrorBuild failure
log
[48/170] Building C object zephyr/arch/arch/arm64/core/CMakeFiles/arch__arm64__core.dir/fatal.c.obj
[115/170] Building C object zephyr/kernel/CMakeFiles/kernel.dir/fatal.c.obj
129s0
rock_5b_plus/rk3588/smpkernel.semaphoreerrorBuild failure
log
[48/172] Building C object zephyr/arch/arch/arm64/core/CMakeFiles/arch__arm64__core.dir/fatal.c.obj
[116/172] Building C object zephyr/kernel/CMakeFiles/kernel.dir/fatal.c.obj
49s0
rock_5b_plus/rk3588/smpkernel.semaphore.usageerrorBuild failure
log
[48/170] Building C object zephyr/arch/arch/arm64/core/CMakeFiles/arch__arm64__core.dir/fatal.c.obj
[115/170] Building C object zephyr/kernel/CMakeFiles/kernel.dir/fatal.c.obj
131s0
rts5912_evb/rts5912application_development.ram_context_for_isrerrorBuild failure - error: 'gpio_wake_init_once' undeclared (first use in this function)
log
…drivers/gpio/gpio_rts5912.c:608:47: error: 'gpio_wake_hold' undeclared (first use in this function)
/__w/zephyr/zephyr/drivers/gpio/gpio_rts5912.c:605:41: error: 'gpio_wake_init_once' undeclared (first use in this function)
/__w/zephyr/zephyr/drivers/gpio/gpio_rts5912.c:606:56: error: 'gpio_wake_delay_work' undeclared (first use in this function)
/__w/zephyr/zephyr/drivers/gpio/gpio_rts5912.c:607:41: error: 'gpio_wake_delay_work_handler' undeclared (first use in this function)
/__w/zephyr/zephyr/drivers/gpio/gpio_rts5912.c:608:47: error: 'gpio_wake_hold' undeclared (first use in this function)
90s0
ruuvi_ruuvitag/nrf52832drivers.gpio.gpio_nrferrorBuild failure - undefined reference to `nrfx_gpiote_channel_alloc'
log
…_in_event_get'
/opt/toolchains/zephyr-sdk-1.0.1/gnu/arm-zephyr-eabi/bin/../lib/gcc/arm-zephyr-eabi/14.3.0/../../../../arm-zephyr-eabi/bin/ld.bfd: /__w/zephyr/zephyr/drivers/spi/spi_nrfx_common.c:53:(.text.spi_nrfx_wake_request+0x1a): undefined reference to `nrfx_gpiote_trigger_enable'
/opt/toolchains/zephyr-sdk-1.0.1/gnu/arm-zephyr-eabi/bin/../lib/gcc/arm-zephyr-eabi/14.3.0/../../../../arm-zephyr-eabi/bin/ld.bfd: /__w/zephyr/zephyr/drivers/spi/spi_nrfx_common.c:70:(.text.spi_nrfx_wake_request+0x48): undefined reference to `nrfx_gpiote_trigger_disable'
collect2: error: ld returned 1 exit status
95s0
scobc_v1/versal_rpudrivers.disk.disk_performance.sdhcerrorBuild failure - error: #error "No disk device defined, is your board supported?"
log
/__w/zephyr/zephyr/tests/drivers/disk/disk_performance/src/main.c:26:2: error: #error "No disk device defined, is your board supported?"
   26 | #error "No disk device defined, is your board supported?"
/__w/zephyr/zephyr/tests/drivers/disk/disk_performance/src/main.c:52:32: error: 'DISK_NAME' undeclared here (not in a function)
20s0
scobc_v1/versal_rpusample.filesystem.fat_fserrorBuild failure - error: #error Wrong FF_VOLUMES setting
log
[58/157] Building C object zephyr/arch/arch/arm/core/CMakeFiles/arch__arm__core.dir/fatal.c.obj
/__w/zephyr/modules/fs/fatfs/ff.c:465:2: error: #error Wrong FF_VOLUMES setting
  465 | #error Wrong FF_VOLUMES setting
43s0
siwx917_dk2605a/siwg917m111mgtbaarch.arm.interrupt.no_optimizationserrorBuild failure - undefined reference to `__device_dts_ord_31'
log
…thumb/v7e-m/nofp" -lc -lgcc && cd /__w/zephyr/zephyr/twister-out/siwx917_dk2605a_siwg917m111mgtba/zephyr_gnu/tests/arch/arm/arm_interrupt/arch.arm.interrupt.no_optimizations/zephyr && /usr/bin/cmake -E true
/__w/zephyr/zephyr/drivers/clock_control/clock_control_silabs_siwx91x_common.c:99:(.text.siwx91x_clock_request_xtal_to_nwp+0x14): undefined reference to `__device_dts_ord_31'
/__w/zephyr/zephyr/drivers/clock_control/clock_control_silabs_siwx91x_common.c:111:(.text.siwx91x_clock_release_xtal_to_nwp+0x14): undefined reference to `__device_dts_ord_31'
collect2: error: ld returned 1 exit status
100s0
siwx917_dk2605a/siwg917m111mgtbaarch.arm.swap.common.fpu_sharing.no_optimizationserrorBuild failure - undefined reference to `__device_dts_ord_31'
log
…" -lc -lgcc && cd /__w/zephyr/zephyr/twister-out/siwx917_dk2605a_siwg917m111mgtba/zephyr_gnu/tests/arch/arm/arm_thread_swap/arch.arm.swap.common.fpu_sharing.no_optimizations/zephyr && /usr/bin/cmake -E true
/__w/zephyr/zephyr/drivers/clock_control/clock_control_silabs_siwx91x_common.c:99:(.text.siwx91x_clock_request_xtal_to_nwp+0x18): undefined reference to `__device_dts_ord_31'
/__w/zephyr/zephyr/drivers/clock_control/clock_control_silabs_siwx91x_common.c:111:(.text.siwx91x_clock_release_xtal_to_nwp+0x18): undefined reference to `__device_dts_ord_31'
collect2: error: ld returned 1 exit status
125s0
siwx917_dk2605a/siwg917m111mgtbaarch.arm.swap.common.no_optimizationserrorBuild failure - undefined reference to `__device_dts_ord_31'
log
…b/v7e-m/nofp" -lc -lgcc && cd /__w/zephyr/zephyr/twister-out/siwx917_dk2605a_siwg917m111mgtba/zephyr_gnu/tests/arch/arm/arm_thread_swap/arch.arm.swap.common.no_optimizations/zephyr && /usr/bin/cmake -E true
/__w/zephyr/zephyr/drivers/clock_control/clock_control_silabs_siwx91x_common.c:99:(.text.siwx91x_clock_request_xtal_to_nwp+0x14): undefined reference to `__device_dts_ord_31'
/__w/zephyr/zephyr/drivers/clock_control/clock_control_silabs_siwx91x_common.c:111:(.text.siwx91x_clock_release_xtal_to_nwp+0x14): undefined reference to `__device_dts_ord_31'
collect2: error: ld returned 1 exit status
121s0
siwx917_ek2708a/siwg917y111mgabaarch.arm.interrupt.no_optimizationserrorBuild failure - undefined reference to `__device_dts_ord_35'
log
…thumb/v7e-m/nofp" -lc -lgcc && cd /__w/zephyr/zephyr/twister-out/siwx917_ek2708a_siwg917y111mgaba/zephyr_gnu/tests/arch/arm/arm_interrupt/arch.arm.interrupt.no_optimizations/zephyr && /usr/bin/cmake -E true
/__w/zephyr/zephyr/drivers/clock_control/clock_control_silabs_siwx91x_common.c:99:(.text.siwx91x_clock_request_xtal_to_nwp+0x14): undefined reference to `__device_dts_ord_35'
/__w/zephyr/zephyr/drivers/clock_control/clock_control_silabs_siwx91x_common.c:111:(.text.siwx91x_clock_release_xtal_to_nwp+0x14): undefined reference to `__device_dts_ord_35'
collect2: error: ld returned 1 exit status
101s0
siwx917_ek2708a/siwg917y111mgabaarch.arm.swap.common.fpu_sharing.no_optimizationserrorBuild failure - undefined reference to `__device_dts_ord_35'
log
…" -lc -lgcc && cd /__w/zephyr/zephyr/twister-out/siwx917_ek2708a_siwg917y111mgaba/zephyr_gnu/tests/arch/arm/arm_thread_swap/arch.arm.swap.common.fpu_sharing.no_optimizations/zephyr && /usr/bin/cmake -E true
/__w/zephyr/zephyr/drivers/clock_control/clock_control_silabs_siwx91x_common.c:99:(.text.siwx91x_clock_request_xtal_to_nwp+0x18): undefined reference to `__device_dts_ord_35'
/__w/zephyr/zephyr/drivers/clock_control/clock_control_silabs_siwx91x_common.c:111:(.text.siwx91x_clock_release_xtal_to_nwp+0x18): undefined reference to `__device_dts_ord_35'
collect2: error: ld returned 1 exit status
129s0
siwx917_ek2708a/siwg917y111mgabaarch.arm.swap.common.no_optimizationserrorBuild failure - undefined reference to `__device_dts_ord_35'
log
…b/v7e-m/nofp" -lc -lgcc && cd /__w/zephyr/zephyr/twister-out/siwx917_ek2708a_siwg917y111mgaba/zephyr_gnu/tests/arch/arm/arm_thread_swap/arch.arm.swap.common.no_optimizations/zephyr && /usr/bin/cmake -E true
/__w/zephyr/zephyr/drivers/clock_control/clock_control_silabs_siwx91x_common.c:99:(.text.siwx91x_clock_request_xtal_to_nwp+0x14): undefined reference to `__device_dts_ord_35'
/__w/zephyr/zephyr/drivers/clock_control/clock_control_silabs_siwx91x_common.c:111:(.text.siwx91x_clock_release_xtal_to_nwp+0x14): undefined reference to `__device_dts_ord_35'
collect2: error: ld returned 1 exit status
118s0
siwx917_rb4338a/siwg917m111mgtbaarch.arm.interrupt.no_optimizationserrorBuild failure - undefined reference to `__device_dts_ord_32'
log
…thumb/v7e-m/nofp" -lc -lgcc && cd /__w/zephyr/zephyr/twister-out/siwx917_rb4338a_siwg917m111mgtba/zephyr_gnu/tests/arch/arm/arm_interrupt/arch.arm.interrupt.no_optimizations/zephyr && /usr/bin/cmake -E true
/__w/zephyr/zephyr/drivers/clock_control/clock_control_silabs_siwx91x_common.c:99:(.text.siwx91x_clock_request_xtal_to_nwp+0x14): undefined reference to `__device_dts_ord_32'
/__w/zephyr/zephyr/drivers/clock_control/clock_control_silabs_siwx91x_common.c:111:(.text.siwx91x_clock_release_xtal_to_nwp+0x14): undefined reference to `__device_dts_ord_32'
collect2: error: ld returned 1 exit status
101s0
siwx917_rb4338a/siwg917m111mgtbaarch.arm.swap.common.fpu_sharing.no_optimizationserrorBuild failure - undefined reference to `__device_dts_ord_32'
log
…" -lc -lgcc && cd /__w/zephyr/zephyr/twister-out/siwx917_rb4338a_siwg917m111mgtba/zephyr_gnu/tests/arch/arm/arm_thread_swap/arch.arm.swap.common.fpu_sharing.no_optimizations/zephyr && /usr/bin/cmake -E true
/__w/zephyr/zephyr/drivers/clock_control/clock_control_silabs_siwx91x_common.c:99:(.text.siwx91x_clock_request_xtal_to_nwp+0x18): undefined reference to `__device_dts_ord_32'
/__w/zephyr/zephyr/drivers/clock_control/clock_control_silabs_siwx91x_common.c:111:(.text.siwx91x_clock_release_xtal_to_nwp+0x18): undefined reference to `__device_dts_ord_32'
collect2: error: ld returned 1 exit status
132s0
siwx917_rb4338a/siwg917m111mgtbaarch.arm.swap.common.no_optimizationserrorBuild failure - undefined reference to `__device_dts_ord_32'
log
…b/v7e-m/nofp" -lc -lgcc && cd /__w/zephyr/zephyr/twister-out/siwx917_rb4338a_siwg917m111mgtba/zephyr_gnu/tests/arch/arm/arm_thread_swap/arch.arm.swap.common.no_optimizations/zephyr && /usr/bin/cmake -E true
/__w/zephyr/zephyr/drivers/clock_control/clock_control_silabs_siwx91x_common.c:99:(.text.siwx91x_clock_request_xtal_to_nwp+0x14): undefined reference to `__device_dts_ord_32'
/__w/zephyr/zephyr/drivers/clock_control/clock_control_silabs_siwx91x_common.c:111:(.text.siwx91x_clock_release_xtal_to_nwp+0x14): undefined reference to `__device_dts_ord_32'
collect2: error: ld returned 1 exit status
125s0
siwx917_rb4342a/siwg917m111mgtbaarch.arm.interrupt.no_optimizationserrorBuild failure - undefined reference to `__device_dts_ord_26'
log
…thumb/v7e-m/nofp" -lc -lgcc && cd /__w/zephyr/zephyr/twister-out/siwx917_rb4342a_siwg917m111mgtba/zephyr_gnu/tests/arch/arm/arm_interrupt/arch.arm.interrupt.no_optimizations/zephyr && /usr/bin/cmake -E true
/__w/zephyr/zephyr/drivers/clock_control/clock_control_silabs_siwx91x_common.c:99:(.text.siwx91x_clock_request_xtal_to_nwp+0x14): undefined reference to `__device_dts_ord_26'
/__w/zephyr/zephyr/drivers/clock_control/clock_control_silabs_siwx91x_common.c:111:(.text.siwx91x_clock_release_xtal_to_nwp+0x14): undefined reference to `__device_dts_ord_26'
collect2: error: ld returned 1 exit status
110s0
siwx917_rb4342a/siwg917m111mgtbaarch.arm.swap.common.fpu_sharing.no_optimizationserrorBuild failure - undefined reference to `__device_dts_ord_26'
log
…" -lc -lgcc && cd /__w/zephyr/zephyr/twister-out/siwx917_rb4342a_siwg917m111mgtba/zephyr_gnu/tests/arch/arm/arm_thread_swap/arch.arm.swap.common.fpu_sharing.no_optimizations/zephyr && /usr/bin/cmake -E true
/__w/zephyr/zephyr/drivers/clock_control/clock_control_silabs_siwx91x_common.c:99:(.text.siwx91x_clock_request_xtal_to_nwp+0x18): undefined reference to `__device_dts_ord_26'
/__w/zephyr/zephyr/drivers/clock_control/clock_control_silabs_siwx91x_common.c:111:(.text.siwx91x_clock_release_xtal_to_nwp+0x18): undefined reference to `__device_dts_ord_26'
collect2: error: ld returned 1 exit status
129s0
siwx917_rb4342a/siwg917m111mgtbaarch.arm.swap.common.no_optimizationserrorBuild failure - undefined reference to `__device_dts_ord_26'
log
…b/v7e-m/nofp" -lc -lgcc && cd /__w/zephyr/zephyr/twister-out/siwx917_rb4342a_siwg917m111mgtba/zephyr_gnu/tests/arch/arm/arm_thread_swap/arch.arm.swap.common.no_optimizations/zephyr && /usr/bin/cmake -E true
/__w/zephyr/zephyr/drivers/clock_control/clock_control_silabs_siwx91x_common.c:99:(.text.siwx91x_clock_request_xtal_to_nwp+0x14): undefined reference to `__device_dts_ord_26'
/__w/zephyr/zephyr/drivers/clock_control/clock_control_silabs_siwx91x_common.c:111:(.text.siwx91x_clock_release_xtal_to_nwp+0x14): undefined reference to `__device_dts_ord_26'
collect2: error: ld returned 1 exit status
128s0
sixg301_rb4407a/simg301m104lilmgmt.mcumgr.os.info.bterrorCMake build failure - CMake Error at /__w/zephyr/zephyr/cmake/modules/extensions.cmake:2482 (message): Blob for path
log
CMake Error at /__w/zephyr/zephyr/cmake/modules/extensions.cmake:2482 (message):
7s0
sixg301_rb4407a/simg301m104lilsample.net.quic.service.echo_clienterrorBuild failure - error: #error "Unsupported partial support for ECC curves acceleration, see docs/driver-only-builds.md"
log
[83/476] Building C object zephyr/arch/arch/arm/core/CMakeFiles/arch__arm__core.dir/fatal.c.obj
/__w/zephyr/modules/crypto/tf-psa-crypto/core/tf_psa_crypto_check_config.h:77:2: error: #error "Unsupported partial support for ECC curves acceleration, see docs/driver-only-builds.md"
   77 | #error "Unsupported partial support for ECC curves acceleration, see docs/driver-only-builds.md"
140s0
sixg301_rb4407a/simg301m104lilsample.net.quic.service.echo_serviceerrorBuild failure - error: #error "Unsupported partial support for ECC curves acceleration, see docs/driver-only-builds.md"
log
[85/526] Building C object zephyr/arch/arch/arm/core/CMakeFiles/arch__arm__core.dir/fatal.c.obj
/__w/zephyr/modules/crypto/tf-psa-crypto/core/tf_psa_crypto_check_config.h:77:2: error: #error "Unsupported partial support for ECC curves acceleration, see docs/driver-only-builds.md"
   77 | #error "Unsupported partial support for ECC curves acceleration, see docs/driver-only-builds.md"
147s0
sltb010a@0/efr32bg22c224f512im40mgmt.mcumgr.os.info.bterrorCMake build failure - CMake Error at /__w/zephyr/zephyr/cmake/modules/extensions.cmake:2482 (message): Blob for path
log
CMake Error at /__w/zephyr/zephyr/cmake/modules/extensions.cmake:2482 (message):
7s0
sltb010a@2/efr32bg22c224f512im40mgmt.mcumgr.os.info.bterrorCMake build failure - CMake Error at /__w/zephyr/zephyr/cmake/modules/extensions.cmake:2482 (message): Blob for path
log
CMake Error at /__w/zephyr/zephyr/cmake/modules/extensions.cmake:2482 (message):
7s0
slwrb4182a/efr32mg22c224f512im40mgmt.mcumgr.os.info.bterrorCMake build failure - CMake Error at /__w/zephyr/zephyr/cmake/modules/extensions.cmake:2482 (message): Blob for path
log
CMake Error at /__w/zephyr/zephyr/cmake/modules/extensions.cmake:2482 (message):
7s0
slwrb4311a/bgm220pc22hnamgmt.mcumgr.os.info.bterrorCMake build failure - CMake Error at /__w/zephyr/zephyr/cmake/modules/extensions.cmake:2482 (message): Blob for path
log
CMake Error at /__w/zephyr/zephyr/cmake/modules/extensions.cmake:2482 (message):
7s0
stm32h573i_dk/stm32h573xx/nsnet.socket.tcperrorBuild failure - error: 'SetSysClock' defined but not used [-Werror=unused-function]
log
…ext/target/stm/common/stm32h5xx/secure/tfm_hal_isolation.o -MF secure_fw/spm/CMakeFiles/tfm_spm.dir/__/__/platform/ext/target/stm/common/stm32h5xx/secure/tfm_hal_isolation.o.d -o secure_fw/spm/CMakeFiles/tfm_spm.dir/__/__/platform/ext/target/stm/common/stm32h5xx/secure/tfm_hal_isolation.o -c /__w/zephyr/modules/tee/tf-m/trusted-firmware-m/platform/ext/target/stm/common/stm32h5xx/secure/tfm_hal_isolation.c
/__w/zephyr/modules/tee/tf-m/trusted-firmware-m/platform/ext/target/stm/common/stm32h5xx/secure/tfm_hal_isolation.c:290:13: error: 'SetSysClock' defined but not used [-Werror=unused-function]
21s0
stm32h573i_dk/stm32h573xx/nsnet.socket.tcp.preempterrorBuild failure - error: 'SetSysClock' defined but not used [-Werror=unused-function]
log
…ext/target/stm/common/stm32h5xx/secure/tfm_hal_isolation.o -MF secure_fw/spm/CMakeFiles/tfm_spm.dir/__/__/platform/ext/target/stm/common/stm32h5xx/secure/tfm_hal_isolation.o.d -o secure_fw/spm/CMakeFiles/tfm_spm.dir/__/__/platform/ext/target/stm/common/stm32h5xx/secure/tfm_hal_isolation.o -c /__w/zephyr/modules/tee/tf-m/trusted-firmware-m/platform/ext/target/stm/common/stm32h5xx/secure/tfm_hal_isolation.c
/__w/zephyr/modules/tee/tf-m/trusted-firmware-m/platform/ext/target/stm/common/stm32h5xx/secure/tfm_hal_isolation.c:290:13: error: 'SetSysClock' defined but not used [-Werror=unused-function]
19s0
thingy53/nrf5340/cpuappdrivers.sensor.shellerrorBuild failure - error: data definition has no type or storage class [-Werror]
log
…bj
/__w/zephyr/zephyr/drivers/sensor/bosch/bme680/bme680.c:520:9: error: data definition has no type or storage class [-Werror]
/__w/zephyr/zephyr/drivers/sensor/bosch/bme680/bme680.c:520:9: error: type defaults to 'int' in declaration of 'I2C_DT_IODEV_DEFINE' [-Wimplicit-int]
/__w/zephyr/zephyr/drivers/sensor/bosch/bme680/bme680.c:558:23: error: parameter names (without types) in function declaration [-Wdeclaration-missing-parameter-type]
/__w/zephyr/zephyr/drivers/sensor/bosch/bme680/bme680.c:530:23: error: 'bme680_iodev_0' undeclared here (not in a function); did you mean 'bme680_config_0'?
185s0
thingy53/nrf5340/cpuapp/nsdrivers.sensor.shellerrorBuild failure - error: data definition has no type or storage class [-Werror]
log
…bj
/__w/zephyr/zephyr/drivers/sensor/bosch/bme680/bme680.c:520:9: error: data definition has no type or storage class [-Werror]
/__w/zephyr/zephyr/drivers/sensor/bosch/bme680/bme680.c:520:9: error: type defaults to 'int' in declaration of 'I2C_DT_IODEV_DEFINE' [-Wimplicit-int]
/__w/zephyr/zephyr/drivers/sensor/bosch/bme680/bme680.c:558:23: error: parameter names (without types) in function declaration [-Wdeclaration-missing-parameter-type]
/__w/zephyr/zephyr/drivers/sensor/bosch/bme680/bme680.c:530:23: error: 'bme680_iodev_0' undeclared here (not in a function); did you mean 'bme680_config_0'?
269s0
ubx_evknorab2/nrf54l10/cpuflprarch.interrupt.minimallibcerrorBuild failure - in function `sys_clock_driver_init':
log
…ort-section=alignment  -Wl,-u,_OffsetAbsSyms  -Wl,-u,_ConfigAbsSyms  -nostdlib  -static  -znoexecstack  -Wl,-X  -Wl,-N  -Wl,--orphan-handling=warn  -Wl,-no-pie  -Wl,--undefined=_sw_isr_table  -Wl,--undefined=_irq_vector_table -L"/opt/toolchains/zephyr-sdk-1.0.1/gnu/riscv64-zephyr-elf/bin/../lib/gcc/riscv64-zephyr-elf/14.3.0/rv32emc_zicsr_zcb_zba_zbb_zbc_zbs/ilp32e/space"  -lgcc && cd /__w/zephyr/zephyr/twister-out/ubx_evknorab2_nrf54l10_cpuflpr/zephyr_gnu/tests/arch/common/interrupt/arch.interrupt.minimallibc/interrupt/zephyr && /usr/bin/cmake -E true
collect2: error: ld returned 1 exit status
119s0
ubx_evknorab2/nrf54l15/cpuflprarch.interrupt.minimallibcerrorBuild failure - in function `sys_clock_driver_init':
log
…ort-section=alignment  -Wl,-u,_OffsetAbsSyms  -Wl,-u,_ConfigAbsSyms  -nostdlib  -static  -znoexecstack  -Wl,-X  -Wl,-N  -Wl,--orphan-handling=warn  -Wl,-no-pie  -Wl,--undefined=_sw_isr_table  -Wl,--undefined=_irq_vector_table -L"/opt/toolchains/zephyr-sdk-1.0.1/gnu/riscv64-zephyr-elf/bin/../lib/gcc/riscv64-zephyr-elf/14.3.0/rv32emc_zicsr_zcb_zba_zbb_zbc_zbs/ilp32e/space"  -lgcc && cd /__w/zephyr/zephyr/twister-out/ubx_evknorab2_nrf54l15_cpuflpr/zephyr_gnu/tests/arch/common/interrupt/arch.interrupt.minimallibc/interrupt/zephyr && /usr/bin/cmake -E true
collect2: error: ld returned 1 exit status
142s0
waveshare_open103z/stm32f103xedrivers.adcerrorBuild failure - undefined reference to `__device_dts_ord_12'
log
…dt.constprop.0+0x30): undefined reference to `__device_dts_ord_12'
/__w/zephyr/zephyr/include/zephyr/drivers/adc.h:1089:(.text.init_adc+0x78): undefined reference to `__device_dts_ord_12'
/__w/zephyr/zephyr/tests/drivers/adc/adc_api/src/test_adc.c:84:(.text.get_adc_device+0x1c): undefined reference to `__device_dts_ord_12'
/opt/toolchains/zephyr-sdk-1.0.1/gnu/arm-zephyr-eabi/bin/../lib/gcc/arm-zephyr-eabi/14.3.0/../../../../arm-zephyr-eabi/bin/ld.bfd: app/libapp.a(test_adc.c.obj):(.rodata.adc_channels+0x0): undefined reference to `__device_dts_ord_12'
collect2: error: ld returned 1 exit status
122s0
weact_stm32g431_core/stm32g431xxlibraries.devicetree.api_exterrorBuild failure - error: 'adc_sub_stm32_init' defined but not used [-Werror=unused-function]
log
…176] Building C object zephyr/arch/arch/arm/core/CMakeFiles/arch__arm__core.dir/fatal.c.obj
/__w/zephyr/zephyr/drivers/adc/adc_stm32.c:2365:12: error: 'adc_sub_stm32_init' defined but not used [-Werror=unused-function]
/__w/zephyr/zephyr/drivers/adc/adc_stm32.c:2121:12: error: 'adc_stm32_channel_setup' defined but not used [-Werror=unused-function]
/__w/zephyr/zephyr/drivers/adc/adc_stm32.c:1880:12: error: 'adc_stm32_read_sync' defined but not used [-Werror=unused-function]
/__w/zephyr/zephyr/drivers/adc/adc_stm32.c:1726:13: error: 'adc_stm32_isr' defined but not used [-Werror=unused-function]
89s0
xg21_rb4195b/efr32mg21b010f1024im32mgmt.mcumgr.os.info.bterrorCMake build failure - CMake Error at /__w/zephyr/zephyr/cmake/modules/extensions.cmake:2482 (message): Blob for path
log
CMake Error at /__w/zephyr/zephyr/cmake/modules/extensions.cmake:2482 (message):
7s0
xg21_rb4196b/efr32mg21b020f1024im32mgmt.mcumgr.os.info.bterrorCMake build failure - CMake Error at /__w/zephyr/zephyr/cmake/modules/extensions.cmake:2482 (message): Blob for path
log
CMake Error at /__w/zephyr/zephyr/cmake/modules/extensions.cmake:2482 (message):
7s0
xg22_ek2710a/efr32mg22e224f512im40mgmt.mcumgr.os.info.bterrorCMake build failure - CMake Error at /__w/zephyr/zephyr/cmake/modules/extensions.cmake:2482 (message): Blob for path
log
CMake Error at /__w/zephyr/zephyr/cmake/modules/extensions.cmake:2482 (message):
7s0
xg22_rb4415a/efr32mg22e224f512im40mgmt.mcumgr.os.info.bterrorCMake build failure - CMake Error at /__w/zephyr/zephyr/cmake/modules/extensions.cmake:2482 (message): Blob for path
log
CMake Error at /__w/zephyr/zephyr/cmake/modules/extensions.cmake:2482 (message):
7s0
xg24_dk2601b/efr32mg24b310f1536im48mgmt.mcumgr.os.info.bterrorCMake build failure - CMake Error at /__w/zephyr/zephyr/cmake/modules/extensions.cmake:2482 (message): Blob for path
log
CMake Error at /__w/zephyr/zephyr/cmake/modules/extensions.cmake:2482 (message):
7s0
xg24_ek2703a/efr32mg24b210f1536im48mgmt.mcumgr.os.info.bterrorCMake build failure - CMake Error at /__w/zephyr/zephyr/cmake/modules/extensions.cmake:2482 (message): Blob for path
log
CMake Error at /__w/zephyr/zephyr/cmake/modules/extensions.cmake:2482 (message):
7s0
xg24_rb4186c/efr32mg24b210f1536im48mgmt.mcumgr.os.info.bterrorCMake build failure - CMake Error at /__w/zephyr/zephyr/cmake/modules/extensions.cmake:2482 (message): Blob for path
log
CMake Error at /__w/zephyr/zephyr/cmake/modules/extensions.cmake:2482 (message):
7s0
xg24_rb4187c/efr32mg24b220f1536im48mgmt.mcumgr.os.info.bterrorCMake build failure - CMake Error at /__w/zephyr/zephyr/cmake/modules/extensions.cmake:2482 (message): Blob for path
log
CMake Error at /__w/zephyr/zephyr/cmake/modules/extensions.cmake:2482 (message):
7s0
xg24_rb4188a/efr32mg24b220f1536im48mgmt.mcumgr.os.info.bterrorCMake build failure - CMake Error at /__w/zephyr/zephyr/cmake/modules/extensions.cmake:2482 (message): Blob for path
log
CMake Error at /__w/zephyr/zephyr/cmake/modules/extensions.cmake:2482 (message):
7s0
xg26_dk2608a/efr32mg26b510f3200im68mgmt.mcumgr.os.info.bterrorCMake build failure - CMake Error at /__w/zephyr/zephyr/cmake/modules/extensions.cmake:2482 (message): Blob for path
log
CMake Error at /__w/zephyr/zephyr/cmake/modules/extensions.cmake:2482 (message):
6s0
xg26_ek2709a/efr32mg26b510f3200im48mgmt.mcumgr.os.info.bterrorCMake build failure - CMake Error at /__w/zephyr/zephyr/cmake/modules/extensions.cmake:2482 (message): Blob for path
log
CMake Error at /__w/zephyr/zephyr/cmake/modules/extensions.cmake:2482 (message):
6s0
xg27_dk2602a/efr32bg27c140f768im40mgmt.mcumgr.os.info.bterrorCMake build failure - CMake Error at /__w/zephyr/zephyr/cmake/modules/extensions.cmake:2482 (message): Blob for path
log
CMake Error at /__w/zephyr/zephyr/cmake/modules/extensions.cmake:2482 (message):
6s0
xg27_rb4194a/efr32mg27c140f768im40mgmt.mcumgr.os.info.bterrorCMake build failure - CMake Error at /__w/zephyr/zephyr/cmake/modules/extensions.cmake:2482 (message): Blob for path
log
CMake Error at /__w/zephyr/zephyr/cmake/modules/extensions.cmake:2482 (message):
6s0
xg28_ek2705a/efr32zg28b312f1024im48mgmt.mcumgr.os.info.bterrorCMake build failure - CMake Error at /__w/zephyr/zephyr/cmake/modules/extensions.cmake:2482 (message): Blob for path
log
CMake Error at /__w/zephyr/zephyr/cmake/modules/extensions.cmake:2482 (message):
7s0
xg29_rb4412a/efr32mg29b140f1024im40mgmt.mcumgr.os.info.bterrorCMake build failure - CMake Error at /__w/zephyr/zephyr/cmake/modules/extensions.cmake:2482 (message): Blob for path
log
CMake Error at /__w/zephyr/zephyr/cmake/modules/extensions.cmake:2482 (message):
7s0
xg29_rb4413a/efr32mg29b230f1024cm40mgmt.mcumgr.os.info.bterrorCMake build failure - CMake Error at /__w/zephyr/zephyr/cmake/modules/extensions.cmake:2482 (message): Blob for path
log
CMake Error at /__w/zephyr/zephyr/cmake/modules/extensions.cmake:2482 (message):
6s0
xgm240_rb4316a/mgm240pb22vnamgmt.mcumgr.os.info.bterrorCMake build failure - CMake Error at /__w/zephyr/zephyr/cmake/modules/extensions.cmake:2482 (message): Blob for path
log
CMake Error at /__w/zephyr/zephyr/cmake/modules/extensions.cmake:2482 (message):
6s0
xgm240_rb4317a/mgm240pb32vnamgmt.mcumgr.os.info.bterrorCMake build failure - CMake Error at /__w/zephyr/zephyr/cmake/modules/extensions.cmake:2482 (message): Blob for path
log
CMake Error at /__w/zephyr/zephyr/cmake/modules/extensions.cmake:2482 (message):
6s0
xgm240_rb4318a/mgm240sd22vnamgmt.mcumgr.os.info.bterrorCMake build failure - CMake Error at /__w/zephyr/zephyr/cmake/modules/extensions.cmake:2482 (message): Blob for path
log
CMake Error at /__w/zephyr/zephyr/cmake/modules/extensions.cmake:2482 (message):
6s0
xiao_mg24/efr32mg24b220f1536im48mgmt.mcumgr.os.info.bterrorCMake build failure - CMake Error at /__w/zephyr/zephyr/cmake/modules/extensions.cmake:2482 (message): Blob for path
log
CMake Error at /__w/zephyr/zephyr/cmake/modules/extensions.cmake:2482 (message):
7s0

By Architecture and Toolchain

ArchInstancesBuiltFailuresNot runFiltered/skippedFailure rate
arm763,346560,372121560,251202,974
0.0%
arm6446,88536,1162036,09610,769
0.1%
riscv115,55681,9341181,92333,622
0.0%
posix8,2797,01657,0111,263
0.1%
xtensa70,42949,668349,66520,761
0.0%
arc18,30413,626013,6264,678
0.0%
x8612,8449,97909,9792,865
0.0%
rx4,6543,26103,2611,393
0.0%
sparc1,7591,27201,272487
0.0%
mips1,1298470847282
0.0%
openrisc7005470547153
0.0%
hexagon169147014722
0.0%
unit12212201220
0.0%

Toolchains

ToolchainInstancesBuiltFailuresNot runFiltered/skippedFailure rate
zephyr/gnu1,034,615756,741155756,586277,874
0.0%
host/gnu6,4765,41955,4141,057
0.1%
host/llvm1,9231,71701,717206
0.0%
zephyr/llvm9918810881110
0.0%
hexagon169147014722
0.0%
host/gcc22020
0.0%

Build Time

1,044,172 timed builds, 23,783.5 CPU hours in total, 82.0s on average. 0 instances were retried (0 retries).

Slowest single builds

TestPlatformBuild time
net.build.no_compat_namespacing_openthreadfrdm_rw612/rw6122,027.2s
sample.net.sockets.http_client.tlsek_ra8p1/r7ka8p1kflcac/cm851,503.1s
sample.net.sockets.http_client.tlsek_ra8d2/r7ka8d2kflcac/cm851,473.5s
sample.net.sockets.http_clientra8p1_titan/r7ka8p1kflcac/cm851,434.5s
sample.net.sockets.http_client.tlsek_ra8t2/r7ka8t2lflcac/cm851,425.0s
sample.net.sockets.http_clientra8p1_titan_mini/r7ka8p1kflcac/cm851,416.1s
portability.posix.netra8p1_titan/r7ka8p1kflcac/cm851,412.7s
portability.posix.netra8p1_titan_mini/r7ka8p1kflcac/cm851,409.4s
sample.net.sockets.http_client.tlsek_ra8m2/r7ka8m2jflcac/cm851,408.5s
net.socket.af_packet.mgmt_eventra8p1_titan_mini/r7ka8p1kflcac/cm851,368.0s
net.socket.af_packet.mgmt_eventra8p1_titan/r7ka8p1kflcac/cm851,358.5s
sample.net.sockets.http_clientmck_ra8t2/r7ka8t2lflcac/cm851,334.2s
sample.net.sockets.http.server.usbd_cdc_ncmra8p1_titan/r7ka8p1kflcac/cm851,320.0s
net.mqtt.packetek_ra8p1/r7ka8p1kflcac/cm851,103.9s
kernel.memory_protection.stackprotek_ra8p1/r7ka8p1kflcac/cm851,096.3s
kernel.memory_protection.stackprotek_ra8d2/r7ka8d2kflcac/cm851,083.9s
bootloader.mcubootvmu_rt1170/mimxrt1176/cm71,083.6s
kernel.memory_protection.stackprotek_ra8p1/r7ka8p1kflcac/cm331,078.3s
net.mqtt.packetek_ra8d2/r7ka8d2kflcac/cm851,071.8s
kernel.memory_protection.stackprotek_ra8t2/r7ka8t2lflcac/cm851,070.5s
kernel.memory_protection.stackprotek_ra8m2/r7ka8m2jflcac/cm851,065.5s
crypto.rng.random_hw_xoshiroek_ra8d2/r7ka8d2kflcac/cm851,062.0s
net.mqtt.packetek_ra8t2/r7ka8t2lflcac/cm851,051.9s
crypto.rng.random_hw_xoshiroek_ra8p1/r7ka8p1kflcac/cm331,048.0s
net.mqtt.packetek_ra8m2/r7ka8m2jflcac/cm851,044.1s
net.socket.af_packet.mgmt_eventmck_ra8t2/r7ka8t2lflcac/cm851,037.4s
kernel.memory_protection.stackprotra8p1_titan_mini/r7ka8p1kflcac/cm851,037.2s
crypto.secp256r1.p256-m_rawra8p1_titan_mini/r7ka8p1kflcac/cm851,034.9s
crypto.secp256r1.p256-m_rawra8p1_titan/r7ka8p1kflcac/cm851,030.2s
kernel.memory_protection.stackprotra8p1_titan_mini/r7ka8p1kflcac/cm331,026.4s
crypto.rng.random_hw_xoshiroek_ra8p1/r7ka8p1kflcac/cm851,023.9s
crypto.secp256r1.p256-m_rawra8p1_titan_mini/r7ka8p1kflcac/cm331,020.2s
crypto.secp256r1.p256-m_rawra8p1_titan/r7ka8p1kflcac/cm331,019.0s
kernel.memory_protection.stackprotra8p1_titan/r7ka8p1kflcac/cm851,018.6s
crypto.rng.random_hw_xoshiroek_ra8t2/r7ka8t2lflcac/cm851,017.7s
kernel.memory_protection.stackprotra8p1_titan/r7ka8p1kflcac/cm331,011.5s
kernel.memory_protection.stackprotcpkcor_ra8d1b/r7fa8d1bhecbd1,000.5s
bluetooth.audio.testernrf5340_audio_dk/nrf5340/cpuapp997.8s
kernel.memory_protection.stackprotmck_ra8t2/r7ka8t2lflcac/cm85979.6s
crypto.rng.random_hw_xoshiroek_ra8m2/r7ka8m2jflcac/cm85975.4s

Platforms by total build time (top 300)

PlatformBuild timeInstancesAverage
native_sim/native68.25h3,85363.8s
mr_canhubk3/s32k344/mcuboot57.21h931221.2s
stm32h573i_dk/stm32h573xx/ns50.40h971186.9s
ek_ra8p1/r7ka8p1kflcac/cm8547.75h900191.0s
ra8p1_titan/r7ka8p1kflcac/cm8547.26h871195.3s
ek_ra8t2/r7ka8t2lflcac/cm8546.35h925180.4s
ek_ra8d2/r7ka8d2kflcac/cm8546.21h868191.6s
ra8p1_titan_mini/r7ka8p1kflcac/cm8545.84h863191.2s
ek_ra8m2/r7ka8m2jflcac/cm8544.37h866184.4s
vmu_rt1170/mimxrt1176/cm744.04h933169.9s
imx95_evk/mimx9596/m743.78h902174.7s
mck_ra8t2/r7ka8t2lflcac/cm8543.29h855182.3s
s32z2xxdc2@D/s32z270/rtu043.01h941164.5s
s32z2xxdc2@D/s32z270/rtu142.67h939163.6s
s32z2xxdc2@B/s32z270/rtu042.39h924165.2s
imx95_evk/mimx9596/m7/ddr42.22h839181.2s
s32z2xxdc2@B/s32z270/rtu141.97h920164.2s
mimxrt1170_evk@B/mimxrt1176/cm741.71h983152.8s
imx95_evk_15x15/mimx9596/m740.73h864169.7s
imx95_evk/mimx9596/m7/flash39.89h822174.7s
mimxrt1170_evk@A/mimxrt1176/cm739.44h954148.8s
imx943_evk/mimx94398/m3338.79h864161.6s
stm32n6570_dk/stm32n657xx/sb38.74h989141.0s
phyboard_atlas/mimxrt1176/cm738.70h940148.2s
mimxrt1180_evk/mimxrt1189/cm3338.64h936148.6s
imx943_evk/mimx94398/m33/ddr38.50h842164.6s
mimxrt1160_evk/mimxrt1166/cm737.60h944143.4s
thingy53/nrf5340/cpuapp/ns36.37h841155.7s
stm32h573i_dk/stm32h573xx/ext_flash_app36.33h683191.5s
nrf54h20dk@0.9.0/nrf54h20/cpuapp36.11h840154.7s
nrf93m1dk@0.4.0/nrf54l15/cpuapp/ns35.49h904141.3s
frdm_imxrt1186/mimxrt1186/cm3334.96h943133.5s
nucleo_n657x0_q/stm32n657xx/sb34.90h971129.4s
frdm_mcxn947/mcxn947/cpu034.76h1,017123.1s
nrf52840dk/nrf5284034.62h1,28297.2s
mimxrt1060_evk@C/mimxrt1062/qspi34.56h1,000124.4s
nrf5340dk/nrf5340/cpuapp/ns34.22h888138.7s
arduino_portenta_h7@1.0.0/stm32h747xx/m734.14h904136.0s
arduino_portenta_h7@4.10.0/stm32h747xx/m734.14h904135.9s
nucleo_c5a3zg/stm32c5a3xx33.95h999122.4s
mimxrt1060_evk@B/mimxrt1062/qspi33.28h964124.3s
mimxrt1064_evk/mimxrt106433.24h976122.6s
stm32h573i_dk/stm32h573xx32.74h1,028114.6s
stm32h5f5j_dk/stm32h5f5xx32.56h979119.7s
mimxrt1062_fmurt6/mimxrt106232.56h956122.6s
mimxrt1060_evk@C/mimxrt1062/hyperflash32.19h962120.5s
mcx_n9xx_evk/mcxn947/cpu032.12h971119.1s
raytac_mdbt53_db_40/nrf5340/cpuapp/ns31.76h867131.9s
mimxrt1060_evk@A/mimxrt1062/qspi31.69h975117.0s
nrf9131ek/nrf9131/ns31.08h818136.8s
frdm_imxrt1186/mimxrt1186/cm7/extmem31.03h861129.7s
raytac_mdbt53v_db_40/nrf5340/cpuapp/ns30.64h830132.9s
nrf5340dk/nrf5340/cpuapp30.63h1,11299.2s
nrf7120dk/nrf7120/cpuapp/ns30.48h712154.1s
b_u585i_iot02a/stm32u585xx/ns30.46h624175.7s
nucleo_h753zi/stm32h753xx30.43h1,009108.6s
mr_mcxn_t1/mcxn947/cpu030.20h939115.8s
frdm_rw612/rw61230.17h975111.4s
nrf9160dk@0.14.0/nrf9160/ns30.13h821132.1s
nrf9160dk@0.7.0/nrf9160/ns30.00h820131.7s
stm32h7_hdmi_board/stm32h747xx/m729.77h932115.0s
mr_navq95b/mimx9596/m7/flash29.66h619172.5s
stm32h747i_disco/stm32h747xx/m729.64h908117.5s
mr_navq95b/mimx9596/m7/ddr29.57h609174.8s
nrf9161dk@0.7.0/nrf9161/ns29.56h805132.2s
stm32h7s78_dk/stm32h7s7xx/ext_flash_app29.53h581183.0s
stm32h745i_disco/stm32h745xx/m729.48h943112.5s
nrf9161dk@0.9.0/nrf9161/ns29.39h806131.2s
mimxrt1040_evk/mimxrt104229.31h924114.2s
mr_navq95b/mimx9596/m729.07h633165.3s
nrf7120dk/nrf7120e/cpuapp/ns28.92h690150.9s
frdm_mcxa577/mcxa57728.91h964108.0s
nucleo_h743zi/stm32h743xx28.88h992104.8s
mimxrt1050_evk/mimxrt1052/qspi28.86h947109.7s
linum/stm32h753xx28.78h930111.4s
mimxrt1050_evk/mimxrt1052/hyperflash28.75h960107.8s
nucleo_h563zi/stm32h563xx28.51h957107.3s
stm32l562e_dk/stm32l562xx/ns28.48h658155.8s
stm32h757i_eval/stm32h757xx/m728.40h889115.0s
nucleo_h723zg/stm32h723xx28.08h978103.3s
nucleo_h7s3l8/stm32h7s3xx/ext_flash_app28.06h594170.0s
rd_rw612_bga/rw61228.04h950106.3s
armfly_stm32h743xih6/stm32h743xx27.98h923109.1s
thingy53/nrf5340/cpuapp27.93h897112.1s
stm32h7_renode_reference_board/stm32h753xx27.74h916109.0s
nrf93m1dk@0.4.0/nrf54l15/cpuapp27.44h908108.8s
esp32c5_devkitc/esp32c5/hpcore27.34h841117.0s
nucleo_h745zi_q/stm32h745xx/m727.30h954103.0s
esp32p4x_function_ev_board/esp32p4/hpcore27.23h814120.4s
frdm_mcxn947/mcxn947/cpu0/ns27.12h587166.3s
mimxrt1024_evk/mimxrt102427.06h930104.7s
nrf54h20dk@0.9.0/nrf54h20/cpurad27.02h666146.0s
quill_nrf52840_mesh/nrf5284027.01h935104.0s
stm32h735g_disco/stm32h735xx26.98h907107.1s
nrf7120dk/nrf7120/cpuapp26.98h807120.3s
nucleo_h755zi_q/stm32h755xx/m726.97h931104.3s
imx952_evk/mimx9529/m726.82h617156.5s
kit_pse84_eval/pse846gps2dbzc4a/m33/ns26.65h671143.0s
nrf54lm20dk/nrf54lm20b/cpuapp/ns26.65h694138.2s
mimxrt1020_evk/mimxrt102126.62h940102.0s
nrf54lm20dk/nrf54lm20a/cpuapp/ns26.61h692138.4s
nrf9151dk/nrf9151/ns26.60h807118.6s
mr_canhubk3/s32k34426.59h950100.8s
imx952_evk/mimx9529/m7/ddr26.47h610156.2s
nrf54l15dk/nrf54l15/cpuapp/ns26.39h708134.2s
fvp_corstone1000/a32026.33h514184.4s
frdm_mcxa577/mcxa577/t1s26.29h854110.8s
esp32c6_devkitc/esp32c6/hpcore26.16h847111.2s
emsbc_neon_cm7/stm32f769xx26.09h924101.7s
xiao_ble/nrf52840/sense25.98h921101.6s
nrf7002dk/nrf5340/cpuapp25.92h95697.6s
stm32wba65i_dk1/stm32wba65xx/ns25.90h614151.9s
nucleo_f746zg/stm32f746xx25.79h99893.0s
xiao_ble/nrf5284025.78h922100.7s
mimxrt1180_evk/mimxrt1189/cm725.75h699132.6s
nucleo_wba65ri/stm32wba65xx/ns25.74h613151.1s
kit_pse84_ai/pse846gps2dbzc4a/m33/ns25.62h626147.3s
rd_rw612_bga/rw612/ethernet25.57h851108.2s
kit_pse84_eval/pse846gps2dbzc4a/m5525.53h721127.5s
m5stack_unitc6l/esp32c6/hpcore25.41h802114.1s
xiao_esp32c5/esp32c5/hpcore25.37h785116.3s
ubx_evk_iris_w1@fidelix/rw612/ethernet25.34h855106.7s
imx943_evk/mimx94398/m7_025.31h603151.1s
xiao_nrf54lm20b/nrf54lm20b/cpuapp25.30h671135.7s
imx943_evk/mimx94398/m7_125.27h602151.1s
s32k5xxcvb/s32k566/m725.23h715127.0s
nucode_nu40/nrf5284025.19h904100.3s
art_pi/stm32h750xx25.15h833108.7s
frdm_mcxw72/mcxw727c25.09h93696.5s
bl5340_dvk/nrf5340/cpuapp/ns25.06h670134.7s
frdm_mcxa577/mcxa577/ns25.01h621145.0s
raytac_mdbt50q_cx_40_dongle/nrf5284024.96h874102.8s
esp32p4_wifi6_dev_kit/esp32p4/hpcore24.90h755118.7s
nrf52840dongle/nrf5284024.85h90299.2s
nrf5340_audio_dk/nrf5340/cpuapp/ns24.83h650137.5s
stm32f769i_disco/stm32f769xx24.81h91697.5s
nucode_nu40/nrf52840/bare24.76h90498.6s
nucleo_f767zi/stm32f767xx24.69h96692.0s
nrf9280pdk@0.2.0/nrf9280/cpuapp24.64h694127.8s
esp32h2_devkitm/esp32h224.62h826107.3s
heltec_t114_v2/nrf5284024.56h89199.2s
stm32f746g_disco/stm32f746xx24.48h93594.3s
mcxw72_evk/mcxw727c24.47h92395.4s
promicro_nrf52840/nrf5284024.45h89298.7s
adafruit_feather_esp32c6/esp32c6/hpcore24.36h789111.2s
frdm_k64f/mk64f1224.36h1,05483.2s
kit_pse84_ai/pse846gps2dbzc4a/m5524.34h705124.3s
stm32h7s78_dk/stm32h7s7xx24.31h776112.8s
bl54l15_dvk/nrf54l15/cpuapp/ns24.29h682128.2s
nrf52840dongle/nrf52840/bare24.20h89597.4s
esp32c61_devkitc/esp32c6124.20h792110.0s
nucleo_f429zi/stm32f429xx24.16h98588.3s
nrf54l15dk/nrf54l15/cpuapp24.15h857101.5s
promicro_nrf52840/nrf52840/uf224.04h89297.0s
frdm_mcxn947/mcxn947/cpu0/qspi24.00h749115.4s
sam_e54_xpro/atsame54p20a23.99h98188.1s
weact_esp32c6_mini/esp32c6/hpcore23.97h800107.9s
heltec_t114_v2/nrf52840/uf223.95h88197.9s
panb611evb/nrf54l15/cpuapp/ns23.93h683126.2s
xiao_esp32c6/esp32c6/hpcore23.93h783110.0s
ec4l15ba1/nrf54l15/cpuapp/ns23.90h676127.3s
bl54l15_dvk/nrf54l10/cpuapp/ns23.90h672128.0s
xiao_stm32c5/stm32c5a3xx23.85h668128.6s
esp32h2_supermini/esp32h223.78h814105.2s
raytac_an54lv_db_15/nrf54l15/cpuapp/ns23.76h671127.5s
frdm_mcxw71/mcxw716c23.70h89994.9s
m5stack_nanoc6/esp32c6/hpcore23.68h793107.5s
frdm_mcxw70/mcxw70ac23.58h86198.6s
frdm_imxrt1186/mimxrt1186/cm723.54h691122.6s
arduino_nicla_vision/stm32h747xx/m723.51h676125.2s
rak4631/nrf5284023.48h90393.6s
mimxrt1170_evk@B/mimxrt1176/cm423.45h628134.4s
nucleo_f439zi/stm32f439xx23.40h95788.0s
ubx_evknorab2/nrf54l15/cpuapp/ns23.35h653128.8s
raytac_an54lq_db_15/nrf54l15/cpuapp/ns23.33h681123.3s
arduino_giga_r1/stm32h747xx/m723.27h676123.9s
s32k5xxcvb/s32k566/r5223.27h714117.3s
nucleo_f756zg/stm32f756xx23.18h93389.4s
nrf54lm20dk/nrf54lm20a/cpuapp23.16h783106.5s
numaker_m55m1/m55m1xxx23.13h87395.4s
raytac_mdbt53_db_40/nrf5340/cpuapp23.11h92090.4s
ek_ra8p1/r7ka8p1kflcac/cm3323.11h634131.2s
raytac_an7002q_db/nrf5340/cpuapp23.08h90691.7s
pan1783a_pa_evb/nrf5340/cpuapp23.05h90192.1s
nrf54lm20dk/nrf54lm20b/cpuapp23.03h779106.4s
apollo510_evb/apollo51023.03h708117.1s
ra8p1_titan/r7ka8p1kflcac/cm3322.92h631130.8s
bl654_usb/nrf5284022.90h87594.2s
ubx_bmd340eval/nrf5284022.78h93687.6s
pinnacle_100_dvk/nrf5284022.78h91989.2s
raytac_mdbt53v_db_40/nrf5340/cpuapp22.75h91289.8s
nrf54l15dk/nrf54l10/cpuapp/ns22.74h633129.4s
ubx_bmd345eval/nrf5284022.71h93087.9s
mimxrt1170_evk@A/mimxrt1176/cm422.70h607134.6s
nrf21540dk/nrf5284022.68h93986.9s
ra8p1_titan_mini/r7ka8p1kflcac/cm3322.67h630129.5s
xg24_rb4187c/efr32mg24b220f1536im4822.66h92288.5s
sixg301_rb4407a/simg301m104lil22.65h91189.5s
ubx_evkninab3/nrf5284022.57h93586.9s
pan1783a_evb/nrf5340/cpuapp22.55h90190.1s
mg100/nrf5284022.54h90789.5s
ubx_evknorab2/nrf54l10/cpuapp/ns22.52h633128.1s
pan1780_evb/nrf5284022.48h94485.7s
raytac_mdbt50q_db_40/nrf5284022.46h92787.2s
mcx_n9xx_evk/mcxn947/cpu0/qspi22.43h723111.7s
sam_v71_xult/samv71q2122.43h96283.9s
nrf7002dk/nrf5340/cpuapp/nrf700122.42h91088.7s
bl654_usb/nrf52840/bare22.42h87592.2s
esp32p4_function_ev_board/esp32p4/hpcore22.35h781103.0s
frdm_mcxe31b@default/mcxe31b22.31h94684.9s
esp32s3_devkitc/esp32s3/procpu22.27h82497.3s
mimxrt700_evk@mx25um51345g/mimxrt798s/cm33_cpu022.16h717111.3s
sam_v71_xult/samv71q21b22.15h96183.0s
mini_stm32h743/stm32h743xx22.15h655121.7s
esp32p4_pc/esp32p4/hpcore22.06h768103.4s
waveshare_esp32p4_eth/esp32p4/hpcore22.04h755105.1s
pan1770_evb/nrf5284022.01h94384.0s
frdm_mcxe31b@w25q64/mcxe31b21.97h92985.1s
nrf7120dk/nrf7120e/cpuapp21.94h691114.3s
xg24_rb4186c/efr32mg24b210f1536im4821.84h89987.5s
nucleo_h7s3l8/stm32h7s3xx21.81h767102.3s
nrf54lv10dk/nrf54lv10a/cpuapp/ns21.74h626125.0s
pan1783_evb/nrf5340/cpuapp21.73h90186.8s
jz_f407vet6/stm32f407xx21.72h92384.7s
sensortile_box_pro/stm32u585xx21.72h684114.3s
xg24_rb4188a/efr32mg24b220f1536im4821.66h89786.9s
nrf52833dk/nrf5283321.64h89187.4s
actinius_icarus@2.0.0/nrf9160/ns21.63h639121.9s
ophelia4ev/nrf54l15/cpuapp21.57h78698.8s
mimxrt700_evk@w25q512nw/mimxrt798s/cm33_cpu021.57h701110.8s
actinius_icarus_som_dk/nrf9160/ns21.57h646120.2s
imx943_evk/mimx94398/a55/smp21.56h758102.4s
esp32_devkitc/esp32/procpu21.56h83093.5s
actinius_icarus@1.4.0/nrf9160/ns21.54h639121.4s
esp32s3_eye/esp32s3/procpu21.52h772100.4s
arduino_opta/stm32h747xx/m721.51h602128.6s
nrf54l15tag/nrf54l15/cpuapp/ns21.49h653118.5s
sam_e70_xplained/same70q2121.42h94581.6s
octopus_io_board/nrf9160/ns21.41h627122.9s
sam_e70_xplained/same70q21b21.40h94082.0s
frdm_imxrt1152/mimxrt115221.40h631122.1s
ek_ra8d1/r7fa8d1bhecbd21.38h664115.9s
ubx_bmd380eval/nrf5284021.33h92283.3s
contextualelectronics_abc/nrf5284021.23h90184.8s
reterminal_e1003/esp32s3/procpu21.19h78397.4s
imx943_evk/mimx94398/a5521.16h79995.3s
octopus_som/nrf9160/ns21.12h627121.3s
mini_stm32h7b0/stm32h7b0xx21.09h654116.1s
aik_ra8d1/r7fa8d1bhecbd21.04h698108.5s
mimxrt1160_evk/mimxrt1166/cm421.02h607124.6s
raytac_mdbt50q_db_33/nrf5283321.00h88785.2s
xiao_nrf54lm20a/nrf54lm20a/cpuapp20.94h647116.5s
nrf9160dk@0.14.0/nrf5284020.88h84089.5s
steval_stwinbx1/stm32u585xx20.84h643116.7s
nucleo_u385rg_q@D/stm32u385xx20.78h77396.8s
actinius_icarus_bee/nrf9160/ns20.77h631118.5s
nrf9160dk@0.7.0/nrf5284020.77h83989.1s
sparkfun_thing_plus/nrf9160/ns20.74h597125.1s
innblue22/nrf9160/ns20.74h596125.3s
innblue21/nrf9160/ns20.71h596125.1s
reterminal_e1001/esp32s3/procpu20.69h76897.0s
htpa_eval/same70q21b20.68h92080.9s
matouch_mtro128g/esp32s3/procpu20.57h76696.7s
htpa_eval/same70q2120.55h92080.4s
nucleo_c562re/stm32c562xx20.52h688107.4s
htpa_eval/same70q20b20.48h91081.0s
ek_ra8m1/r7fa8m1ahecbd20.48h698105.6s
numaker_pfm_m467/m46720.46h86685.0s
native_sim/native/6420.44h1,23859.4s
mimxrt2660_evk/mimxrt2663/cm8520.44h632116.4s
esp32c3_devkitc/esp32c320.33h83088.2s
nucleo_f207zg/stm32f207xx20.33h94977.1s
circuitdojo_feather/nrf9160/ns20.32h597122.6s
esp_wrover_kit/esp32/procpu20.31h77294.7s
frdm_mcxn236/mcxn23620.27h730100.0s
qemu_x86/atom20.25h1,15063.4s
esp32c3_rust/esp32c320.24h79292.0s
shrike_fi/esp32s3/procpu20.22h75896.1s
teensy41/mimxrt106220.21h669108.8s
ek_ra8d2/r7ka8d2kflcac/cm3320.21h634114.8s
esp32s2_devkitc/esp32s220.17h81089.6s
esp_threadbr/esp32s3/procpu/ethernet20.15h76994.3s
mcx_n5xx_evk/mcxn547/cpu020.13h629115.2s
bl654_sensor_board/nrf5284020.11h89181.2s
pic32cx_sg41_cult/pic32cx1025sg4112820.07h94276.7s
same54_xpro/same54p20a20.07h94576.4s
actinius_icarus_som/nrf9160/ns20.01h612117.7s
nucleo_l552ze_q/stm32l552xx/ns19.98h520138.3s
nucleo_u575zi_q/stm32u575xx19.98h72998.7s
olimex_stm32_e407/stm32f407xx19.98h83785.9s
stm32f7508_dk/stm32f750xx19.93h79190.7s
mm_feather/mimxrt106219.85h689103.7s
stm32mp135f_dk/stm32mp135fxx19.78h89679.5s
udoo_key/esp32/procpu19.78h74096.2s
ctcc/nrf9161/ns19.77h586121.4s
dect_nr_plus_usb_dongle/nrf9151/ns19.75h583122.0s
mimxrt595_evk/mimxrt595s/cm3319.72h74295.7s
xg21_rb4196b/efr32mg21b020f1024im3219.67h84583.8s
xg21_rb4195b/efr32mg21b010f1024im3219.66h84683.7s
esp32_ethernet_kit/esp32/procpu19.64h72697.4s

CI Jobs

203 jobs, 815.6 machine hours, 45 not successful.

Jobs that did not succeed

JobConclusionDuration
Check Twister Status / all jobs passedfailure4s
twister-build (1)failure3h 29m
twister-build (10)failure3h 44m
twister-build (116)failure4h 44m
twister-build (120)failure4h 48m
twister-build (14)failure5h 16m
twister-build (153)failure3h 14m
twister-build (162)failure3h 40m
twister-build (165)failure3m 13s
twister-build (173)failure6h 02m
twister-build (181)failure3h 08m
twister-build (182)failure4h 54m
twister-build (183)failure8h 04m
twister-build (184)failure6h 30m
twister-build (187)failure2h 39m
twister-build (188)failure3h 04m
twister-build (191)failure1h 24m
twister-build (192)failure1h 47m
twister-build (198)failure1h 46m
twister-build (199)failure2h 31m
twister-build (20)failure3h 51m
twister-build (21)failure4h 38m
twister-build (22)failure4h 44m
twister-build (23)failure4h 57m
twister-build (28)failure3h 08m
twister-build (3)failure4h 54m
twister-build (30)failure4h 10m
twister-build (33)failure1h 02m
twister-build (34)failure4h 21m
twister-build (39)failure4h 43m
twister-build (42)failure5h 18m
twister-build (47)failure3h 20m
twister-build (5)failure5h 47m
twister-build (50)failure4h 15m
twister-build (51)failure5h 16m
twister-build (52)failure5h 46m
twister-build (54)failure4h 46m
twister-build (56)failure5h 14m
twister-build (59)failure5h 54m
twister-build (6)failure3h 58m
twister-build (60)failure5h 46m
twister-build (61)failure6h 10m
twister-build (70)failure4h 57m
twister-build (85)failure6h 23m
twister-build (86)failure1h 50m

Longest jobs (top 25)

JobConclusionDuration
twister-build (126)success8h 06m
twister-build (183)failure8h 04m
twister-build (82)success6h 54m
twister-build (184)failure6h 30m
twister-build (174)success6h 25m
twister-build (84)success6h 24m
twister-build (85)failure6h 23m
twister-build (128)success6h 21m
twister-build (81)success6h 18m
twister-build (99)success6h 12m
twister-build (61)failure6h 10m
twister-build (79)success6h 03m
twister-build (173)failure6h 02m
twister-build (59)failure5h 54m
twister-build (87)success5h 51m
twister-build (172)success5h 49m
twister-build (169)success5h 48m
twister-build (5)failure5h 47m
twister-build (52)failure5h 46m
twister-build (60)failure5h 46m
twister-build (78)success5h 43m
twister-build (118)success5h 35m
twister-build (125)success5h 33m
twister-build (100)success5h 32m
twister-build (130)success5h 32m

All Platforms

Every platform seen in the run, sorted by failures then size. Sortable and filterable.

PlatformArchInstancesBuiltFailuresNot runPassedFiltered/skipped
beaglebadge/am62l3/a53arm64499395143810104
mps4/corstone315/fvp/nsarm999000
mps4/corstone320/fvp/nsarm999000
rock_5b_plus/rk3588/smparm6450839763910111
nrf9280pdk@0.2.0/nrf9280/cpuapparm69452245180172
mr_mcxn_t1/mcxn947/cpu1arm55836443600194
sixg301_rb4407a/simg301m104lilarm91176137580150
siwx917_rb4338a/siwg917m111mgtbaarm70950535020204
siwx917_dk2605a/siwg917m111mgtbaarm70549934960206
siwx917_ek2708a/siwg917y111mgabaarm68848834850200
siwx917_rb4342a/siwg917m111mgtbaarm67849134880187
stm32h573i_dk/stm32h573xx/nsarm97177527730196
kit_pse84_eval/pse846gps2dbzc4a/m33arm70353425320169
kit_pse84_ai/pse846gps2dbzc4a/m33arm70152625240175
imx952_evk/mimx9529/m7arm61745924570158
scobc_v1/versal_rpuarm57631923170257
nrf52_bsim/nativeposix96482818270136
qemu_cortex_a9/xc7z007sarm94069116900249
quill_nrf52840_mesh/nrf52840arm93576217610173
xg24_rb4187c/efr32mg24b220f1536im48arm92277717760145
pinnacle_100_dvk/nrf52840arm91975117500168
nrf93m1dk@0.4.0/nrf54l15/cpuapparm90873617350172
nrf93m1dk@0.4.0/nrf54l15/cpuapp/nsarm90471017090194
xg24_rb4186c/efr32mg24b210f1536im48arm89974717460152
thingy53/nrf5340/cpuapparm89774017390157
xg24_rb4188a/efr32mg24b220f1536im48arm89774417430153
mps2/an383arm86868616850182
xg21_rb4195b/efr32mg21b010f1024im32arm84669716960149
xg21_rb4196b/efr32mg21b020f1024im32arm84569716960148
thingy53/nrf5340/cpuapp/nsarm84161816170223
ai_m64p_32s_kit/bl616cl4855riscv81063616350174
esp32p4_function_ev_board/esp32p4/hpcoreriscv78161316120168
kit_pse84_eval/pse846gps2dbzc4a/m55arm72155815570163
kit_pse84_ai/pse846gps2dbzc4a/m55arm70553615350169
bl5340_dvk/nrf5340/cpuapparm69753215310165
xg29_rb4412a/efr32mg29b140f1024im40arm69555315520142
xg26_dk2608a/efr32mg26b510f3200im68arm69352015190173
bg29_rb4420a/efr32bg29b220f1024cj45arm68754215410145
xg29_rb4413a/efr32mg29b230f1024cm40arm68652115200165
lyra_24_dvk_p20/bgm240pb32vnaarm68351015090173
lyra_24_dvk_p20rf/bgm240pb32vnnarm68351015090173
lyra_24_dvk_s10/bgm240sb22vnaarm68351015090173
lyra_24_dvk_p10/bgm240pb22vnaarm68250915080173
nrf54l15tag/nrf54l15/cpuapparm67949014890189
kit_pse84_eval/pse846gps2dbzc4a/m33/nsarm67149114900180
xg26_ek2709a/efr32mg26b510f3200im48arm67151815170153
bl5340_dvk/nrf5340/cpuapp/nsarm67049014890180
mgm260p_ek2713a/mgm260pd32vnaarm67051715160153
xg28_ek2705a/efr32zg28b312f1024im48arm67051715160153
xgm240_rb4318a/mgm240sd22vnaarm67051715160153
xgm240_rb4316a/mgm240pb22vnaarm66651715160149
xgm240_rb4317a/mgm240pb32vnaarm66651715160149
xg24_dk2601b/efr32mg24b310f1536im48arm65751915180138
qemu_cortex_r5/zynqmp_rpuarm65650915080147
nrf54l15tag/nrf54l15/cpuapp/nsarm65345614550197
nucleo_wb09ke/stm32wb09arm65243114300221
xg24_ek2703a/efr32mg24b210f1536im48arm64951615150133
nucleo_wba25ce1/stm32wba25xxarm64547614750169
arduino_nano_matter/mgm240sd22vnaarm63850815070130
xiao_mg24/efr32mg24b220f1536im48arm63750815070129
nucleo_wb07cc/stm32wb07arm63641814170218
waveshare_open103z/stm32f103xearm62739513940232
kit_pse84_ai/pse846gps2dbzc4a/m33/nsarm62647914780147
bg27_rb4110b/efr32bg27c320f768gj39arm61246514640147
xg27_rb4194a/efr32mg27c140f768im40arm61146414630147
bg27_rb4111b/efr32bg27c320f768gj39arm61046114600149
mps2/an521/cpu0arm61044214410168
xg27_dk2602a/efr32bg27c140f768im40arm60747114700136
arduino_opta/stm32h747xx/m7arm60248414830118
ruuvi_ruuvitag/nrf52832arm60145414530147
innblue21/nrf9160/nsarm59645014490146
innblue22/nrf9160/nsarm59645014490146
arduino_opta/stm32h747xx/m4arm59244314420149
bgm220_ek4314a/bgm220pc22hnaarm58439813970186
nrf5340bsim/nrf5340/cpuappposix58344614450137
lyra_dvk_p/bgm220pc22hnaarm58139613950185
lyra_dvk_s/bgm220sc22hnaarm58139613950185
innblue22/nrf9160arm58044614450134
sltb010a@0/efr32bg22c224f512im40arm58040214010178
sltb010a@2/efr32bg22c224f512im40arm58040214010178
slwrb4182a/efr32mg22c224f512im40arm57939913980180
slwrb4311a/bgm220pc22hnaarm57939913980180
xg22_rb4415a/efr32mg22e224f512im40arm57939813970181
bg22_ek4108a/efr32bg22c224f512im40arm57839313920185
innblue21/nrf9160arm57844414430134
lp_em_cc2340r5/cc2340r5arm57836913680209
xg22_ek2710a/efr32mg22e224f512im40arm57439213910182
eora_hub_900tb/esp32s3/procpuxtensa57039113900179
rts5912_evb/rts5912arm56938113800188
nucleo_wb05kz/stm32wb05arm56435313520211
nrf54l15bsim/nrf54l15/cpuappposix56242714260135
nrf5340bsim/nrf5340/cpunetposix55942714260132
nrf54l15dk/nrf54l15/cpuflprriscv55135113500200
raytac_an54lv_db_15/nrf54l15/cpuflprriscv55034413430206
bl704l_dvk/bl704l20q2iwriscv54837313720175
ubx_evknorab2/nrf54l15/cpuflprriscv54734213410205
bl54l15_dvk/nrf54l15/cpuflprriscv54434113400203
raytac_an54lq_db_15/nrf54l15/cpuflprriscv54334013390203
bl54l15_dvk/nrf54l10/cpuflprriscv53927812770261
nrf54l15dk/nrf54l10/cpuflprriscv53827912780259
weact_stm32g431_core/stm32g431xxarm53637813770158
ubx_evknorab2/nrf54l10/cpuflprriscv53627712760259
intel_adsp/cavs25xtensa52439113900133
nrf54lm20bsim/nrf54lm20a/cpuappposix52038413830136
intel_adsp/cavs25/tgphxtensa47134513440126
native_sim/nativeposix3,8533,44103,4410412
nrf52840dk/nrf52840arm1,2821,11601,1160166
native_sim/native/64posix1,2381,06301,0630175
qemu_x86/atomx861,1501,04201,0420108
nrf5340dk/nrf5340/cpuapparm1,11293609360176
frdm_k64f/mk64f12arm1,05488608860168
stm32h573i_dk/stm32h573xxarm1,02885608560172
frdm_mcxn947/mcxn947/cpu0arm1,01784608460171
nucleo_h753zi/stm32h753xxarm1,00984108410168
mimxrt1060_evk@C/mimxrt1062/qspiarm1,00082508250175
nucleo_c5a3zg/stm32c5a3xxarm99982608260173
nucleo_f746zg/stm32f746xxarm99882608260172
nucleo_h743zi/stm32h743xxarm99280608060186
stm32n6570_dk/stm32n657xx/sbarm98982608260163
nucleo_f429zi/stm32f429xxarm98579707970188
mimxrt1170_evk@B/mimxrt1176/cm7arm98381808180165
qemu_riscv32e/qemu_virt_riscv32eriscv98287208720110
sam_e54_xpro/atsame54p20aarm98180408040177
stm32h5f5j_dk/stm32h5f5xxarm97979807980181
nucleo_h723zg/stm32h723xxarm97879707970181
mimxrt1064_evk/mimxrt1064arm97680508050171
frdm_rw612/rw612arm97580408040171
mimxrt1060_evk@A/mimxrt1062/qspiarm97580108010174
mcx_n9xx_evk/mcxn947/cpu0arm97180208020169
nucleo_n657x0_q/stm32n657xx/sbarm97180208020169
nucleo_f767zi/stm32f767xxarm96679607960170
frdm_mcxa577/mcxa577arm96478607860178
mimxrt1060_evk@B/mimxrt1062/qspiarm96479207920172
mimxrt1060_evk@C/mimxrt1062/hyperflasharm96278707870175
sam_v71_xult/samv71q21arm96279207920170
sam_v71_xult/samv71q21barm96179007900171
mimxrt1050_evk/mimxrt1052/hyperflasharm96079107910169
nucleo_f439zi/stm32f439xxarm95776407640193
nucleo_h563zi/stm32h563xxarm95778807880169
mimxrt1062_fmurt6/mimxrt1062arm95677707770179
nrf7002dk/nrf5340/cpuapparm95679607960160
mimxrt1170_evk@A/mimxrt1176/cm7arm95478907890165
nucleo_h745zi_q/stm32h745xx/m7arm95477707770177
mr_canhubk3/s32k344arm95077407740176
rd_rw612_bga/rw612arm95077707770173
mps2/an385arm94977007700179
nucleo_f207zg/stm32f207xxarm94973507350214
mimxrt1050_evk/mimxrt1052/qspiarm94777407740173
frdm_mcxe31b@default/mcxe31barm94672607260220
sam_e70_xplained/same70q21arm94577807780167
same54_xpro/same54p20aarm94577507750170
mimxrt1160_evk/mimxrt1166/cm7arm94477907790165
pan1780_evb/nrf52840arm94477007700174
frdm_imxrt1186/mimxrt1186/cm33arm94376107610182
pan1770_evb/nrf52840arm94376907690174
stm32h745i_disco/stm32h745xx/m7arm94377807780165
pic32cx_sg41_cult/pic32cx1025sg41128arm94277107710171
s32z2xxdc2@D/s32z270/rtu0arm94173107310210
mimxrt1020_evk/mimxrt1021arm94076907690171
phyboard_atlas/mimxrt1176/cm7arm94077907790161
sam_e70_xplained/same70q21barm94077107710169
mr_mcxn_t1/mcxn947/cpu0arm93976107610178
nrf21540dk/nrf52840arm93976807680171
s32z2xxdc2@D/s32z270/rtu1arm93972907290210
frdm_mcxw72/mcxw727carm93677107710165
mimxrt1180_evk/mimxrt1189/cm33arm93676907690167
ubx_bmd340eval/nrf52840arm93676607660170
stm32f746g_disco/stm32f746xxarm93576607660169
ubx_evkninab3/nrf52840arm93576507650170
pic32cx_sg61_cult/pic32cx1025sg61128arm93476107610173
nucleo_f756zg/stm32f756xxarm93375807580175
vmu_rt1170/mimxrt1176/cm7arm93376607660167
stm32h7_hdmi_board/stm32h747xx/m7arm93277507750157
mr_canhubk3/s32k344/mcubootarm93175107510180
nucleo_h755zi_q/stm32h755xx/m7arm93176707670164
linum/stm32h753xxarm93076607660164
mimxrt1024_evk/mimxrt1024arm93078107810149
ubx_bmd345eval/nrf52840arm93076107610169
frdm_mcxe31b@w25q64/mcxe31barm92971407140215
raytac_mdbt50q_db_40/nrf52840arm92775607560171
ek_ra8t2/r7ka8t2lflcac/cm85arm92575207520173
w6300_evb_pico2/rp2350a/m33_0arm92570107010224
emsbc_neon_cm7/stm32f769xxarm92476807680156
mimxrt1040_evk/mimxrt1042arm92475407540170
s32z2xxdc2@B/s32z270/rtu0arm92472107210203
armfly_stm32h743xih6/stm32h743xxarm92374707470176
jz_f407vet6/stm32f407xxarm92372707270196
mcxw72_evk/mcxw727carm92376007600163
ubx_bmd380eval/nrf52840arm92275407540168
xiao_ble/nrf52840arm92274907490173
xiao_ble/nrf52840/sensearm92174807480173
xmc47_relax_kit/xmc4700arm92171407140207
htpa_eval/same70q21arm92073607360184
htpa_eval/same70q21barm92073607360184
raytac_mdbt53_db_40/nrf5340/cpuapparm92074607460174
s32z2xxdc2@B/s32z270/rtu1arm92071707170203
stm32f769i_disco/stm32f769xxarm91675307530163
stm32h7_renode_reference_board/stm32h753xxarm91676407640152
raytac_mdbt53v_db_40/nrf5340/cpuapparm91273607360176
htpa_eval/same70q20barm91073007300180
nrf7002dk/nrf5340/cpuapp/nrf7001arm91075107510159
stm32h747i_disco/stm32h747xx/m7arm90877207720136
mg100/nrf52840arm90774007400167
stm32h735g_disco/stm32h735xxarm90776507650142
raytac_an7002q_db/nrf5340/cpuapparm90674707470159
arduino_portenta_h7@1.0.0/stm32h747xx/m7arm90473707370167
arduino_portenta_h7@4.10.0/stm32h747xx/m7arm90473707370167
nucode_nu40/nrf52840/barearm90473807380166
nucode_nu40/nrf52840arm90473807380166
rak4631/nrf52840arm90374407440159
nrf52840dongle/nrf52840arm90275107510151
imx95_evk/mimx9596/m7arm90271007100192
contextualelectronics_abc/nrf52840arm90173807380163
pan1783_evb/nrf5340/cpuapparm90174207420159
pan1783a_evb/nrf5340/cpuapparm90174207420159
pan1783a_pa_evb/nrf5340/cpuapparm90174207420159
ek_ra8p1/r7ka8p1kflcac/cm85arm90075007500150
frdm_mcxw71/mcxw716carm89973307330166
sam4e_xpro/sam4e16earm89771107110186
stm32mp135f_dk/stm32mp135fxxarm89660606060290
nrf52840dongle/nrf52840/barearm89574407440151
promicro_nrf52840/nrf52840/uf2arm89274007400152
promicro_nrf52840/nrf52840arm89274307430149
bl654_sensor_board/nrf52840arm89173407340157
heltec_t114_v2/nrf52840arm89174007400151
nrf52833dk/nrf52833arm89175907590132
stm32h757i_eval/stm32h757xx/m7arm88975507550134
nrf5340dk/nrf5340/cpuapp/nsarm88869606960192
raytac_mdbt50q_db_33/nrf52833arm88772007200167
slwrb4321a/efm32gg11b820f2048gm64arm88573207320153
heltec_t114_v2/nrf52840/uf2arm88172907290152
ip_k66f/mk66f18arm88072207220158
slstk3701a/efm32gg11b820f2048gl192arm87873207320146
adi_eval_adin1140d1z/max32690/m4arm87570507050170
bl654_usb/nrf52840/barearm87573707370138
bl654_usb/nrf52840arm87573707370138
raytac_mdbt50q_cx_40_dongle/nrf52840arm87474007400134
numaker_m55m1/m55m1xxxarm87373707370136
xmc45_relax_kit/xmc4500arm87369306930180
ra8p1_titan/r7ka8p1kflcac/cm85arm87173007300141
ek_ra8d2/r7ka8d2kflcac/cm85arm86873107310137
raytac_mdbt53_db_40/nrf5340/cpuapp/nsarm86767106710196
cc1352p7_lp/cc1352p7arm86671207120154
ek_ra8m2/r7ka8m2jflcac/cm85arm86673007300136
numaker_pfm_m467/m467arm86673107310135
imx943_evk/mimx94398/m33arm86467706770187
imx95_evk_15x15/mimx9596/m7arm86466806680196
ra8p1_titan_mini/r7ka8p1kflcac/cm85arm86372207220141
frdm_imxrt1186/mimxrt1186/cm7/extmemarm86170607060155
frdm_mcxw70/mcxw70acarm86173407340127
nrf54l15dk/nrf54l15/cpuapparm85769406940163
mck_ra8t2/r7ka8t2lflcac/cm85arm85572207220133
ubx_evk_iris_w1@fidelix/rw612/ethernetarm85573407340121
frdm_mcxa577/mcxa577/t1sarm85473007300124
nucleo_h745zi_q/stm32h745xx/m4arm85365506550198
rd_rw612_bga/rw612/ethernetarm85173307330118
stm32_micrium/stm32f107xcarm85160406040247
zedboard/xc7z020arm85058405840266
qemu_riscv32/qemu_virt_riscv32riscv8497630763086
esp32c6_devkitc/esp32c6/hpcoreriscv84769106910156
cc3220sf_launchxl/cc3220sfarm84562706270218
imx943_evk/mimx94398/m33/ddrarm84268806880154
cc3235sf_launchxl/cc3235sfarm84162306230218
esp32c5_devkitc/esp32c5/hpcoreriscv84168206820159
decawave_dwm3001cdk/nrf52833arm84071107110129
nrf54h20dk@0.9.0/nrf54h20/cpuapparm84067806780162
nrf9160dk@0.14.0/nrf52840arm84071307130127
nrf9160dk@0.7.0/nrf52840arm83971207120127
imx95_evk/mimx9596/m7/ddrarm83969706970142
olimex_stm32_e407/stm32f407xxarm83770307030134
art_pi/stm32h750xxarm83357905790254
nucleo_h755zi_q/stm32h755xx/m4arm83164706470184
raytac_mdbt53v_db_40/nrf5340/cpuapp/nsarm83065406540176
bl618g0/bl618m05q2iriscv83065506550175
esp32_devkitc/esp32/procpuxtensa83066806680162
esp32c3_devkitc/esp32c3riscv83064406440186
esp32h2_devkitm/esp32h2riscv82667006700156
qemu_riscv64/qemu_virt_riscv64riscv8257370737088
esp32s3_devkitc/esp32s3/procpuxtensa82465306530171
imx95_evk/mimx9596/m7/flasharm82268606860136
nrf9160dk@0.14.0/nrf9160/nsarm82165506550166
nrf9160dk@0.7.0/nrf9160/nsarm82065406540166
nrf9131ek/nrf9131/nsarm81862606260192
ai_m62_12f_kit/bl616c50q2iriscv81764106410176
esp32h2_supermini/esp32h2riscv81465006500164
esp32p4x_function_ev_board/esp32p4/hpcoreriscv81466706670147
esp8684_devkitm/esp32c2riscv81162706270184
esp32s2_devkitc/esp32s2xtensa81062606260184
litex_vexriscv/litex_vexriscvriscv80862506250183
nrf7120dk/nrf7120/cpuapparm80764606460161
nrf9151dk/nrf9151/nsarm80764706470160
nrf9161dk@0.9.0/nrf9161/nsarm80664606460160
ai_m61_32s_kit@DEFAULT/bl618m05q2iriscv80663506350171
nrf9161dk@0.7.0/nrf9161/nsarm80564506450160
ai_wb2_12f_kit/bl602c00q2iriscv80563006300175
samr21_xpro/samr21g18aarm80250705070295
m5stack_unitc6l/esp32c6/hpcoreriscv80265606560146
maix_m0s_dock/bl616c50q2iriscv80163306330168
weact_esp32c6_mini/esp32c6/hpcoreriscv80064106410159
imx943_evk/mimx94398/a55arm6479962606260173
esp32c3_devkitm/esp32c3riscv79761606160181
qemu_cortex_m3/ti_lm3s6965arm79361206120181
m5stack_nanoc6/esp32c6/hpcoreriscv79363806380155
esp32c3_rust/esp32c3riscv79261506150177
esp32c61_devkitc/esp32c61riscv79263806380154
nano_ch32v317/ch32v317/ram_192kriscv79261306130179
stm32f7508_dk/stm32f750xxarm79134503450446
ch32v307v_evt_r1/ch32v307/ram_192kriscv79161206120179
adafruit_feather_esp32c6/esp32c6/hpcoreriscv78964006400149
ophelia4ev/nrf54l15/cpuapparm78662006200166
xiao_esp32c5/esp32c5/hpcoreriscv78563806380147
nrf54lm20dk/nrf54lm20a/cpuapparm78362006200163
reterminal_e1003/esp32s3/procpuxtensa78361306130170
xiao_esp32c6/esp32c6/hpcoreriscv78363806380145
tlsr9518adk80d/tlsr9518riscv78163106310150
nrf54lm20dk/nrf54lm20b/cpuapparm77961606160163
nano_ch32v317/ch32v317/ram_128kriscv77760306030174
stm32h7s78_dk/stm32h7s7xxarm77634303430433
ch32v307v_evt_r1/ch32v307/ram_128kriscv77560106010174
esp32s2_saola/esp32s2xtensa77460106010173
nucleo_u385rg_q@D/stm32u385xxarm77360006000173
esp32s3_eye/esp32s3/procpuxtensa77260506050167
esp_wrover_kit/esp32/procpuxtensa77262606260146
nrf52833dk/nrf52820arm76950105010268
imx95_evk/mimx9596/a55arm6476961706170152
esp_threadbr/esp32s3/procpu/ethernetxtensa76959605960173
nano_ch32v317/ch32v317/ram_96kriscv76958905890180
ch32v307v_evt_r1/ch32v307/ram_96kriscv76858805880180
esp32p4_pc/esp32p4/hpcoreriscv76861206120156
reterminal_e1001/esp32s3/procpuxtensa76860206020166
nucleo_h7s3l8/stm32h7s3xxarm76732203220445
litex_vexiiriscv/litex_vexiiriscvriscv76761006100157
matouch_mtro128g/esp32s3/procpuxtensa76660006000166
nano_ch32v317/ch32v317/ram_64kriscv76656505650201
ch32v307v_evt_r1/ch32v307/ram_64kriscv76556405640201
mimxrt685_evk/mimxrt685s/cm33arm75858705870171
imx943_evk/mimx94398/a55/smparm6475861806180140
shrike_fi/esp32s3/procpuxtensa75859705970161
pinecone/bl602c20q2iriscv75762006200137
esp32p4_wifi6_dev_kit/esp32p4/hpcoreriscv75562606260129
waveshare_esp32p4_eth/esp32p4/hpcoreriscv75560106010154
roc_rk3588_pc/rk3588arm6475161606160135
frdm_mcxn947/mcxn947/cpu0/qspiarm74958005800169
nrf52dk/nrf52832arm74857805780170
nucleo_wb55rg/stm32wb55xxarm74757705770170
nano_ch32v317/ch32v317riscv74745304530294
nucleo_g474re/stm32g474xxarm74658005800166
b_u585i_iot02a/stm32u585xxarm74456305630181
ch32v307v_evt_r1/ch32v307riscv74345304530290
mimxrt595_evk/mimxrt595s/cm33arm74256805680174
stm32l562e_dk/stm32l562xxarm74157405740167
udoo_key/esp32/procpuxtensa74062306230117
kincony_kc868_a8/esp32/procpuxtensa73960806080131
roc_rk3588_pc/rk3588/smparm6473662106210115
frdm_mcxa366/mcxa366arm73452905290205
bl604e_iot_dvk/bl604e20q2iriscv73260006000132
frdm_mcxn236/mcxn236arm73056405640166
nucleo_u575zi_q/stm32u575xxarm72956605660163
frdm_mcxa266/mcxa266arm72852505250203
nucleo_u5a5zj_q/stm32u5a5xxarm72655905590167
esp32_ethernet_kit/esp32/procpuxtensa72661306130113
frdm_mcxa346/mcxa346arm72451705170207
mcx_n9xx_evk/mcxn947/cpu0/qspiarm72355805580165
nucleo_u3c5zi_q/stm32u3c5xxarm72154205420179
nucleo_f413zh/stm32f413xxarm72053805380182
mimxrt700_evk@mx25um51345g/mimxrt798s/cm33_cpu0arm71755205520165
nucleo_u545re_q/stm32u545xxarm71553505350180
rpi_pico/rp2040arm71546004600255
s32k5xxcvb/s32k566/m7arm71551205120203
s32k5xxcvb/s32k566/r52arm71448004800234
nucleo_f722ze/stm32f722xxarm71354805480165
nrf7120dk/nrf7120/cpuapp/nsarm71252805280184
nucleo_l4r5zi/stm32l4r5xxarm71154105410170
stm32l4r9i_disco/stm32l4r9xxarm70952605260183
apollo510_evb/apollo510arm70853505350173
frdm_mcxa156/mcxa156arm70852105210187
nrf5340_audio_dk/nrf5340/cpuapparm70853905390169
nrf54l15dk/nrf54l15/cpuapp/nsarm70853605360172
disco_l475_iot1/stm32l475xxarm70754505450162
rpi_pico2/rp2350a/m33_0arm70749604960211
fk723m1_zgt6/stm32h723xxarm70652705270179
reel_board@1/nrf52840arm70554305430162
robokit1/same70q21barm70451605160188
adafruit_feather_rfm95_rp2040/rp2040arm70344304430260
nucleo_f412zg/stm32f412zxarm70352005200183
nucleo_wba55cg/stm32wba55xxarm70354805480155
ubx_evk_iris_w1@fidelix/rw612arm70352905290174
adafruit_feather_canbus_rp2040/rp2040arm70244504450257
rddrone_fmuk66/mk66f18arm70253705370165
adafruit_qt_py_rp2040/rp2040arm70144104410260
lpcxpresso55s28/lpc55s28arm70153705370164
mimxrt700_evk@w25q512nw/mimxrt798s/cm33_cpu0arm70153605360165
canbed_rp2040/rp2040arm70044204420258
stm32f723e_disco/stm32f723xxarm70052605260174
qemu_or1k/qemu_or1kopenrisc70054705470153
mimxrt1180_evk/mimxrt1189/cm7arm69950405040195
stm32f469i_disco/stm32f469xxarm69952105210178
weact_stm32wb55_core/stm32wb55xxarm69952105210178
qemu_x86_64/atomx8669859405940104
aik_ra8d1/r7fa8d1bhecbdarm69853205320166
ek_ra8m1/r7fa8m1ahecbdarm69853505350163
blackpill_u585ci/stm32u585xxarm69751705170180
da1469x_dk_pro/da14699arm69752705270170
reel_board@2/nrf52840arm69753505350162
rtl87x2g_evb_a/rtl8762gkuarm69750405040193
nucleo_l496zg/stm32l496xxarm69651405140182
rpi_pico/rp2040/mcubootarm69644804480248
rpi_pico2/rp2350a/m33_0/mcubootarm69649204920204
cortex_r8_virtual/cortex_r8_virtualarm69552005200175
nucleo_g0b1re/stm32g0b1xxarm69549704970198
pico_plus2/rp2350b/m33_0arm69547904790216
beetle_rp2350/rp2350a/m33_0arm69447604760218
motion_2350_pro/rp2350a/m33_0arm69447604760218
nrf54lm20dk/nrf54lm20b/cpuapp/nsarm69451105110183
nucleo_wba65ri/stm32wba65xxarm69453505350159
frdm_k82f/mk82f25615arm69352105210172
rp2040_plus/rp2040arm69343504350258
rp2040_zero/rp2040arm69343304330260
rp2350_zero/rp2350a/m33_0arm69347204720221
rtl87x2g_evb_a/rtl8762gkharm69349304930200
sparkfun_rp2040_mikrobus/rp2040arm69344904490244
udoo_key/rp2040arm69343404340259
w5500_evb_pico2/rp2350a/m33_0arm69347504750218
w55rp20_evb_pico/rp2040arm69343404340259
w6100_evb_pico2/rp2350a/m33_0arm69347404740219
adafruit_macropad_rp2040/rp2040arm69243604360256
b_l4s5i_iot01a/stm32l4s5xxarm69250105010191
max32690evkit/max32690/m4arm69253405340158
nrf54lm20dk/nrf54lm20a/cpuapp/nsarm69251005100182
xiao_rp2350/rp2350a/m33_0arm69248004800212
adafruit_metro_rp2040/rp2040arm69143504350256
cyw920829m2evk_02/cyw20829b0lkmlarm69148304830208
frdm_imxrt1186/mimxrt1186/cm7arm69151005100181
gd32f450z_eval/gd32f450arm69150405040187
nrf7120dk/nrf7120e/cpuapparm69151805180173
nucleo_wl55jc/stm32wl55xxarm69150005000191
pic32cz_ca80_cult/pic32cz8110ca80208arm69152305230168
tiny2040/rp2040arm69143304330258
adafruit_feather_adalogger_rp2040/rp2040arm69043404340256
adi_eval_adin1110ebz/stm32l4s5xxarm69050005000190
arduino_nano_connect/rp2040arm69043804380252
arduino_uno_q/stm32u585xxarm69049504950195
beetle_rp2040/rp2040arm69043204320258
bl54l15_dvk/nrf54l15/cpuapparm69052905290161
cyw920829m2evk_02/cyw20829b1010arm69048204820208
cyw920829m2evk_02/cyw20829b1340arm69048204820208
micromod/nrf52840arm69050805080182
nrf7120dk/nrf7120e/cpuapp/nsarm69050405040186
rp2350b_core/rp2350b/m33_0arm69049004900200
rp2350b_plus_w/rp2350b/m33_0arm69047804780212
rpi_pico/rp2040/warm69042904290261
rpi_pico2/rp2350a/m33_0/warm69047704770213
swan_r5/stm32l4r5xxarm69051805180172
adafruit_feather_propmaker_rp2040/rp2040arm68943104310258
adafruit_feather_rp2040/rp2040arm68943304330256
adafruit_feather_scorpio_rp2040/rp2040arm68943104310258
adafruit_grand_central_m4_express/samd51p20aarm68951205120177
adafruit_itsybitsy_rp2040/rp2040arm68943104310258
adafruit_kb2040/rp2040arm68942904290260
google_dragonclaw/stm32f412cxarm68950305030186
maker_nano_rp2040/rp2040arm68943104310258
maker_uno_rp2040/rp2040arm68943104310258
max32650evkit/max32650arm68950805080181
max32651evkit/max32651arm68950805080181
mm_feather/mimxrt1062arm68951005100179
pico_spe/rp2040arm68943104310258
raytac_an54lq_db_15/nrf54l15/cpuapparm68952205220167
rp2040_matrix/rp2040arm68943004300259
rpi_pico/rp2040/w/mcubootarm68943904390250
rpi_pico2/rp2350a/m33_0/w/mcubootarm68948304830206
sparkfun_pro_micro_rp2040/rp2040arm68942904290260
w5500_evb_pico/rp2040arm68943104310258
w6100_evb_pico/rp2040arm68943004300259
nucleo_c562re/stm32c562xxarm68852705270161
shrike_lite/rp2040arm68843104310257
stm32l496g_disco/stm32l496xxarm68850905090179
xiao_rp2040/rp2040arm68843204320256
adafruit_itsybitsy/nrf52840arm68751505150172
google_icetower/stm32h743xxarm68750205020185
panb611evb/nrf54l15/cpuapparm68751905190168
adafruit_metro_rp2350/rp2350b/m33_0arm68646804680218
pico2_spe/rp2350a/m33_0arm68646704670219
96b_aerocore2/stm32f427xxarm68550905090176
apollo4p_evb/apollo4parm68547904790206
sensortile_box/stm32l4r9xxarm68552105210164
stm32u5a9j_dk/stm32u5a9xxarm68552005200165
xg28_rb4401c/efr32zg28b322f1024im68arm68551805180167
96b_argonkey/stm32f412cxarm68450305030181
bt610/nrf52840arm68451405140170
da14695_dk_usb/da14695arm68451105110173
max32650fthr/max32650arm68450305030181
nucleo_l4a6zg/stm32l4a6xxarm68450205020182
sensortile_box_pro/stm32u585xxarm68452605260158
stm32u5g9j_dk1/stm32u5g9xxarm68451905190165
panb611evb/nrf54l15/cpuapp/nsarm68349804980185
particle_xenon/nrf52840arm68352605260157
stm32h573i_dk/stm32h573xx/ext_flash_apparm68355305530130
bl54l15_dvk/nrf54l15/cpuapp/nsarm68249804980184
particle_argon/nrf52840arm68252405240158
particle_boron/nrf52840arm68252405240158
pg28_pk2506a/efm32pg28b310f1024im68arm68251405140168
frdm_mcxe247@default/mcxe247arm68150305030178
pic32cz_ca90_cult/pic32cz8110ca90208arm68151605160165
raytac_an54lq_db_15/nrf54l15/cpuapp/nsarm68149704970184
stm32u5g9j_dk2/stm32u5g9xxarm68152005200161
nrf54l15dk/nrf54l10/cpuapparm68051705170163
rzt2m_rsk/r9a07g075m24gbg/cr520arm68044404440236
weact_stm32h562_core/stm32h562xxarm68052405240156
raytac_an54lv_db_15/nrf54l15/cpuapparm67951205120167
ubx_evknorab2/nrf54l15/cpuapparm67950905090170
wio_tracker_l1/nrf52840arm67951105110168
apollo3p_evb/apollo3p_bluearm67847704770201
bl54l15_dvk/nrf54l10/cpuapparm67851205120166
arduino_portenta_c33/r7fa6m5bh3cfcarm67748704870190
ec4l15ba1/nrf54l15/cpuapparm67751005100167
rak11720/apollo3_bluearm67747804780199
wio_terminal/samd51p19aarm67749804980179
apollo4p_blue_kxr_evb/apollo4p_bluearm67647504750201
arduino_giga_r1/stm32h747xx/m7arm67651805180158
arduino_nicla_vision/stm32h747xx/m7arm67652005200156
ec4l15ba1/nrf54l15/cpuapp/nsarm67649204920184
nucleo_l152re/stm32l152xearm67647904790197
apard32690@D/max32690/m4arm67553205320143
cy8cproto_063_ble/cyble_416045_02arm67549904990176
frdm_mcxe247@w25q64/mcxe247arm67549904990176
rak5010/nrf52840arm67551905190156
framework_laptop16_keyboard/rp2040arm67441904190255
google_quincy/npcx9mfparm67448004800194
mikroe_quail/stm32f427xxarm67450005000174
nrf52840dk/nrf52811arm67340804080265
stm32h7b3i_dk/stm32h7b3xxqarm67351105110162
bl54l15_dvk/nrf54l10/cpuapp/nsarm67249004900182
core2350b/rp2350b/m33_0arm67247604760196
framework_ledmatrix/rp2040arm67241404140258
we_proteus3ev/nrf52840arm67251105110161
adi_eval_adin2111d1z/max32690/m4arm67150105010170
p2d/nrf52840arm67151105110160
raytac_an54lv_db_15/nrf54l15/cpuapp/nsarm67148904890182
rtl87x2g_evb_a/rtl8762gruarm67147304730198
xiao_nrf54lm20b/nrf54lm20b/cpuapparm67151705170154
maker_pi_rp2040/rp2040arm67042604260244
nucleo_f446re/stm32f446xxarm67051105110159
pg26_ek2711a/efm32pg26b500f3200im68arm67051705170153
rtl87x2g_evb_a/rtl8762grharm67047204720198
xg26_rb4118a/efr32mg26b510f3200il136arm67052005200150
xg26_rb4120a/efr32mg26b510f3200im68arm67052005200150
xg26_rb4121a/efr32mg26b420f3200im68arm67052005200150
mgm260p_rb4350a/mgm260pd22vnaarm66951705170152
mgm260p_rb4351a/mgm260pd32vnaarm66951705170152
teensy41/mimxrt1062arm66951405140155
blackpill_h523ce/stm32h523xxarm66848704870181
gd32f470zit6_core/gd32f470arm66849404940174
max32666fthr/max32666/cpu0arm66850205020166
nucleo_f446ze/stm32f446xxarm66850905090159
ubx_evknorab2/nrf54l10/cpuapparm66850305030165
xiao_stm32c5/stm32c5a3xxarm66850405040164
cy8cproto_062_4343w/cy8c624abzi_s2d44arm66749604960171
nrf9160dk@0.14.0/nrf9160arm66750905090158
nucleo_l476rg/stm32l476xxarm66750605060161
pan1782_evb/nrf52833arm66750505050162
xiao_nrf54l15/nrf54l15/cpuapparm66751705170150
black_f407zg_pro/stm32f407xxarm66649804980168
nrf54h20dk@0.9.0/nrf54h20/cpuradarm66651605160150
rzg3s_smarc/r9a08g045s33gbg/cm33arm66642604260240
stm32mp255c_dhsbc/stm32mp255cxx/m33arm66648504850181
ek_ra8d1/r7fa8d1bhecbdarm66451805180146
myra_sip_baseboard/myraarm66450205020162
nucleo_f401re/stm32f401xearm66448804880176
rp2040_geek/rp2040arm66442704270237
apollo3_evb/apollo3_bluearm66346404640199
frdm_mcxl255/mcxl255/cpu0arm66348604860177
lpcxpresso55s69/lpc55s69/cpu0arm66349904990164
nrf54lv10dk/nrf54lv10a/cpuapparm66350105010162
nucleo_l552ze_q/stm32l552xxarm66351105110152
sltb004a/efr32mg12p332f1024gl125arm66350805080155
weact_stm32f405_core/stm32f405xxarm66347604760187
adafruit_trinkey_qt2040/rp2040arm66242304230239
holyiot_25008/nrf54l15/cpuapparm66151205120149
mimxrt1010_evk/mimxrt1011arm66149504950166
stm32f429i_disc1/stm32f429xxarm66149004900171
adafruit_feather_m4_express/samd51j19aarm66050805080152
adafruit_itsybitsy_m4_express/samd51g19aarm66051305130147
ek_ra8t2/r7ka8t2lflcac/cm33arm66047104710189
gd32f407v_start/gd32f407arm66049004900170
nucleo_f411re/stm32f411xearm66048904890171
bl653_dvk/nrf52833arm65949604960163
croxel_cx1825/nrf52840arm65950805080151
s32k148_evb/s32k148arm65950105010158
stm32l562e_dk/stm32l562xx/nsarm65847504750183
black_f407ve/stm32f407xxarm65749104910166
frdm_mcxw23/mcxw236arm65749204920165
max32657evkit/max32657arm65751205120145
stm32f429ii_aca/stm32f429xxarm65746804680189
canbardo/same70n20barm65653205320124
lpcxpresso55s16/lpc55s16arm65649504950161
pic32cm_jh01_cpro/pic32cm5164jh01100arm65644904490207
stm32mp257f_dk/stm32mp257fxx/m33arm65648704870169
frdm_k22f/mk22f51212arm65546404640191
max32658evkit/max32658arm65550705070148
mcxw23_evk/mcxw236arm65549004900165
mikroe_clicker_2/stm32f407xxarm65548204820173
mini_stm32h743/stm32h743xxarm65551405140141
rzn2l_rsk/r9a07g084m04gbgarm65538703870268
stm32mp257f_ev1/stm32mp257fxx/m33arm65548704870168
weact_stm32f446_core/stm32f446xxarm65546804680187
mini_stm32h7b0/stm32h7b0xxarm65441104110243
max32657evkit/max32657/nsarm65348304830170
ubx_evknorab2/nrf54l15/cpuapp/nsarm65347804780175
qemu_leon3/leon3sparc65352105210132
max32658evkit/max32658/nsarm65247604760176
pic32cm_sg00_cpro/pic32cm5112sg00100arm65245804580194
rzv2l_smarc/r9a07g054l23gbg/cm33arm65241504150237
qemu_cortex_a53/qemu_cortex_a53arm646525560556096
beagleconnect_freedom@C7/cc1352p7arm65149504950156
stm32f3_disco@B/stm32f303xcarm65146504650186
adi_eval_adin2111ebz/stm32l4s5xxarm65048204820168
max32690fthr/max32690/m4arm65049104910159
mck_ra8t1/r7fa8t1ahecbdarm65050705070143
nandeval_h743zi/stm32h743xxarm65050105010149
nrf5340_audio_dk/nrf5340/cpuapp/nsarm65047904790171
st25dv_mb1283_disco/stm32f405xxarm65048304830167
wio_wm1110_dev_kit/nrf52840arm65050405040146
gd32f470i_eval/gd32f470arm64947204720177
rpi_debug_probe/rp2040arm64942604260223
skystar_gd32f407vet6/gd32f407arm64947604760173
sltb009a/efm32gg12b810f1024gm64arm64950305030146
cy8ckit_062_ble@0.0.0/cy8c6347/m0arm64841704170231
cy8ckit_062_ble@1.0.0/cy8c6347/m0arm64841704170231
fk743m5_xih6/stm32h743xxarm64850905090139
pic32cm_gc00_cpro/pic32cm5112gc00100arm64845304530195
sf32lb52_devkit_lcd/sf32lb525uc6arm64850905090139
ucans32k1sic/s32k146arm64846404640184
qemu_rx/r5f562n8rx64850105010147
ek_ra6m4/r7fa6m4af3cfbarm64749004900157
ek_ra6m5/r7fa6m5bh3cfcarm64749004900157
rzg2l_smarc/r9a07g044l23gbg/cm33arm64741304130234
rzv2h_evk/r9a09g057h44gbg/cm33arm64744504450202
rzv2n_evk/r9a09g056n48gbg/cm33arm64744504450202
sama7d65_curiosity/sama7d65arm64738603860261
sama7g54_ek/sama7g54arm64739403940253
slwrb4161a/efr32mg12p432f1024gl125arm64750005000147
slwrb4170a/efr32mg12p433f1024gm68arm64750005000147
xiao_nrf54lm20a/nrf54lm20a/cpuapparm64749704970150
actinius_icarus_som_dk/nrf9160/nsarm64647304730173
fpb_ra8e1/r7fa8e1afdcfbarm64649204920154
mikroe_mini_m4_for_stm32/stm32f415xxarm64647304730173
mikroe_stm32_m4_clicker/stm32f415xxarm64647504750171
nucleo_h7a3zi_q/stm32h7a3xxqarm64450205020142
rzg2lc_smarc/r9a07g044c22gbg/cm33arm64441204120232
rzg2ul_smarc/r9a07g043u11gbg/cm33arm64440304030241
ek_ra6m3/r7fa6m3ah3cfcarm64348304830160
frdm_ke17z512/mke17z9arm64341904190224
nucleo_g071rb/stm32g071xxarm64342704270216
rp2040_keyboard_3/rp2040arm64342304230220
slstk3402a/efm32pg12b500f1024gl125arm64349904990144
sparkfun_thing_plus_matter_mgm240p/mgm240pb32vnaarm64350305030140
steval_stwinbx1/stm32u585xxarm64351405140129
cpkcor_ra8d1b/r7fa8d1bhecbdarm64250705070135
ek_ra6m2/r7fa6m2af3cfbarm64248204820160
nucleo_g491re/stm32g491xxarm64248104810161
sam4s_xplained/sam4s16carm64144404440197
slstk3402a/efm32jg12b500f1024gl125arm64145704570184
stm32wb5mm_dk/stm32wb55xxarm64148604860155
96b_stm32_sensor_mez/stm32f446xxarm64046904690171
max32666evkit/max32666/cpu0arm64049104910149
ubx_evkannab1/nrf52832arm64047004700170
96b_neonkey/stm32f411xearm63946804680171
actinius_icarus@1.4.0/nrf9160/nsarm63946804680171
actinius_icarus@2.0.0/nrf9160/nsarm63947004700169
max32672evkit/max32672arm63947204720167
stm32f412g_disco/stm32f412zxarm63949704970142
ubx_bmd300eval/nrf52832arm63946904690170
arduino_nano_33_ble@rev1/nrf52840/sensearm63848404840154
arduino_nano_33_ble@rev1/nrf52840arm63848404840154
arduino_nano_33_ble@rev2/nrf52840/sensearm63848504850153
arduino_nano_33_ble@rev2/nrf52840arm63848504850153
fpb_ra6e1/r7fa6e10f2cfparm63848104810157
max32672fthr/max32672arm63847104710167
stm32wb5mmg/stm32wb55xxarm63848304830155
am243x_evm/am2434/r5f0_0arm63743104310206
nrf51dk/nrf51822arm63743404340203
nucleo_h533re/stm32h533xxarm63746304630174
az3166_iotdevkit/stm32f412rxarm63646704670169
ek_ra6m1/r7fa6m1ad3cfparm63647404740162
max78000fthr/max78000/m4arm63646004600176
max78002evkit/max78002/m4arm63647004700166
ra8d1_vision_board/r7fa8d1bhecbdarm63650005000136
stm32h750b_dk/stm32h750xxarm63647404740162
nrf52840_mdk_usb_dongle/nrf52840arm63550605060129
nrf9131ek/nrf9131arm63547304730162
cy8ckit_062s2_ai/cy8c624abzi_s2d44arm63448904890145
ek_ra8d2/r7ka8d2kflcac/cm33arm63446304630171
ek_ra8p1/r7ka8p1kflcac/cm33arm63447004700164
mimxrt685_aud_evk/mimxrt685s/cm33arm63450505050129
mm_swiftio/mimxrt1052arm63449904990135
nrf9151dk/nrf9151arm63447404740160
pt2/sf32lb52jud6arm63449004900144
rtl8721f_evb/rtl8721farm63444904490185
teensymm/mimxrt1062arm63449704970137
ubx_evkninab1/nrf52832arm63446504650169
ek_ra8m2/r7ka8m2jflcac/cm33arm63346204620171
frdm_imxrt700/mimxrt798s/cm33_cpu0arm63349004900143
mimxrt700_evk@mx25um51345g/mimxrt798s/cm33_cpu1arm63348404840149
nrf54l15dk/nrf54l05/cpuapparm63347804780155
nrf54l15dk/nrf54l10/cpuapp/nsarm63346204620171
nrf9161dk@0.9.0/nrf9161arm63347304730160
pr2/sf32lb52jud6arm63348804880145
stm32f413h_disco/stm32f413xxarm63349404940139
stm32mp215f_dk/stm32mp215fxx/m33arm63348504850148
teensy40/mimxrt1062arm63349604960137
ubx_evknorab2/nrf54l10/cpuapp/nsarm63346004600173
xg23_rb4210a/efr32zg23b020f512im48arm63347204720161
mr_navq95b/mimx9596/m7arm63346704670166
blackpill_f411ce/stm32f411xearm63246504650167
cy8ckit_062_ble@0.0.0/cy8c6347/m4arm63245204520180
mimxrt2660_evk/mimxrt2663/cm85arm63248304830149
nucleo_f303re/stm32f303xearm63245204520180
rza2m_evk/r7s921053vcbgarm63237203720260
actinius_icarus_bee/nrf9160/nsarm63146004600171
adi_sdp_k1/stm32f469xxarm63148704870144
cy8ckit_062_ble@1.0.0/cy8c6347/m4arm63145104510180
frdm_imxrt1152/mimxrt1152arm63149404940137
imx8mp_var_dart/mimx8ml8/m7/ddrarm63147604760155
nrf9160dk@0.7.0/nrf9160arm63147304730158
nrf9161dk@0.7.0/nrf9161arm63147304730158
pke8721daf_c13_f10/rtl8721dxarm63148404840147
ra8p1_titan/r7ka8p1kflcac/cm33arm63146604660165
sam_e54_cult/atsame54p20aarm63149804980133
96b_carbon/stm32f401xearm63046104610169
actinius_icarus_som_dk/nrf9160arm63047204720158
kit_t2g_b_h_evk/cyt4bfbche/m7_0arm63048604860144
kit_t2g_b_h_evk/cyt4bfbche/m7_1arm63046204620168
kit_t2g_b_h_lite/cyt4bf8cds/m7_0arm63048604860144
kit_t2g_b_h_lite/cyt4bf8cds/m7_1arm63046204620168
kit_xmc72_evk/xmc7200d_e272k8384/m7_0arm63048704870143
kit_xmc72_evk/xmc7200d_e272k8384/m7_1arm63046304630167
numaker_m3351ki/m335xxxarm63048704870143
numaker_m5531/m55m1xxxarm63049604960134
ra8p1_titan_mini/r7ka8p1kflcac/cm33arm63046504650165
blackpill_f401cc/stm32f401xcarm62944604460183
blackpill_f401ce/stm32f401xearm62946104610168
cy8ckit_062_wifi_bt/cy8c6247/m0arm62941304130216
cy8ckit_062_wifi_bt/cy8c6247/m4arm62944804480181
kit_t2g_c2d6m_lite/cyt4dnjbzs/m7_0arm62947304730156
kit_t2g_c2d6m_lite/cyt4dnjbzs/m7_1arm62947304730156
max32655fthr/max32655/m4arm62946604660163
mcx_n5xx_evk/mcxn547/cpu0arm62951905190110
nucleo_f091rc/stm32f091xcarm62941504150214
nucleo_l452re/stm32l452xx/parm62948804880141
numaker_gai_m55m1/m55m1xxxarm62949504950134
octopus_io_board/nrf9160arm62947404740155
pic32ck_gc01_cult/pic32ck2051gc01144arm62947204720157
pic32ck_sg01_cult/pic32ck2051sg01144arm62947404740155
rcar_ironhide_x5h/r8a78000/r52arm62943804380191
stm32wba65i_dk1/stm32wba65xxarm62951005100119
ubx_evkninab4/nrf52833arm62950105010128
frdm_kw41z/mkw41z4arm62941304130216
mimxrt1170_evk@B/mimxrt1176/cm4arm62843204320196
nucleo_l452re/stm32l452xxarm62848704870141
octopus_som/nrf9160arm62847104710157
rzt2l_rsk/r9a07g074m04gbgarm62841904190209
rzv2h_evk/r9a09g057h44gbg/cr8_0arm62842804280200
stm32f401_mini/stm32f401xcarm62844604460182
imx8mp_evk/mimx8ml8/m7/ddrarm62747004700157
octopus_io_board/nrf9160/nsarm62746104610166
octopus_som/nrf9160/nsarm62745904590168
rtl872xda_evb/rtl8721dxarm62748604860141
adafruit_feather_stm32f405/stm32f405xxarm62646804680158
bytesensi_l/nrf52832arm62645804580168
hexiwear/mk64f12arm62648404840142
kg100s_rb4332a/efr32bg21b010f1024im32arm62649504950131
lora_e5_dev_board/stm32wle5xxarm62643404340192
lp_mspm0g3519/mspm0g3519arm62640804080218
nrf54lv10dk/nrf54lv10a/cpuapp/nsarm62645704570169
olimex_lora_stm32wl_devkit@C/stm32wle5xxarm62644004400186
olimex_lora_stm32wl_devkit@D/stm32wle5xxarm62644004400186
pg23_pk2504a/efm32pg23b310f512im48arm62645904590167
rtl872xd_evb/rtl872xdarm62646104610165
we_oceanus1ev@1.1.0/stm32wle5xxarm62643304330193
cygnet/stm32l433xxarm62544604460179
nucleo_c542rc/stm32c542xxarm62546704670158
rak11160/stm32wle5xxarm62543904390186
rak3172/stm32wle5xxarm62543904390186
arduino_nicla_sense_me/nrf52832arm62445604560168
b_u585i_iot02a/stm32u585xx/nsarm62446404640160
ebyte_e73_tbb/nrf52832arm62445704570167
ft9001_eval/ft9001arm62448204820142
actinius_icarus@1.4.0/nrf9160arm62346404640159
actinius_icarus@2.0.0/nrf9160arm62346604660157
arduino_portenta_h7@1.0.0/stm32h747xx/m4arm62349704970126
frdm_imxrt700/mimxrt798s/cm33_cpu1arm62348004800143
imx8mp_var_som/mimx8ml8/m7/ddrarm62347304730150
kit_t2g_b_h_evk/cyt4bfbche/m0parm62325502550368
kit_t2g_b_h_lite/cyt4bf8cds/m0parm62325502550368
npcm400_evb/npcm400arm62340004000223
rcar_h3ulcb/r8a77951/r7arm62338103810242
rts5817_maa_evb/rts5817arm62345904590164
ubx_evknorab2/nrf54l05/cpuapparm62346604660157
verdin_imx8mp/mimx8ml8/m7/ddrarm62347304730150
arduino_giga_r1/stm32h747xx/m4arm62247904790143
ast1030_evb/ast1030arm62244104410181
kv260_r5/zynqmp_rpuarm62245004500172
lp_mspm33c321a/mspm33c321aarm62243704370185
max32670evkit/max32670arm62246004600162
frdm_mcxa577/mcxa577/nsarm62145704570164
imx93_evk/mimx9352/m33/ddrarm62146504650156
nrf5340dk/nrf5340/cpunetarm62147304730148
pocketbeagle_2@A1/am6232/m4arm62142004200201
pocketbeagle_2@A1/am6254/m4arm62142004200201
pocketbeagle_2_industrial@A1/am6254/m4arm62142004200201
arduino_nicla_vision/stm32h747xx/m4arm62047804780142
numaker_m3334ki/m333xxxarm62047904790141
stm32f4_disco/stm32f407xxarm62048404840136
zybo/xc7z010arm62035903590261
segger_trb_stm32f407/stm32f407xxarm61946704670152
mr_navq95b/mimx9596/m7/flasharm61948404840135
lpcxpresso55s36/lpc55s36arm61848904890129
we_proteus2ev/nrf52832arm61845404540164
am62x_m4_bl350/am6254/m4arm61742204220195
ek_ra4m3/r7fa4m3af3cfbarm61746804680149
gd32f450v_start/gd32f450arm61745904590158
kit_psc3m6_eval/psc3m6ges3ahq1arm61747404740143
max32675evkit/max32675arm61745704570160
nucleo_l433rc_p/stm32l433xxarm61745904590158
beagleconnect_freedom@C5/cc1352parm61646504650151
nrf52840_blip/nrf52840arm61648204820134
rcar_salvator_x/r8a77951/r7arm61637403740242
96b_nitrogen/nrf52832arm61545604560159
actinius_icarus_bee/nrf9160arm61545904590156
apollo2_evb/apollo2arm61545804580157
gd32f450i_eval/gd32f450arm61546104610154
mck_ra8t2/r7ka8t2lflcac/cm33arm61546404640151
am243x_evm/am2434/m4arm61443104310183
balletto_b1_dk/ab1c1f4m51820ph0arm61446404640150
beagleplay/am6254/m4arm61441804180196
bt510/nrf52840arm61447504750139
stm32wba65i_dk1/stm32wba65xx/nsarm61447904790135
32f967_dv/em32f967arm61341104110202
bl5340_dvk/nrf5340/cpunetarm61342904290184
kit_psc3m5_evk/psc3m5fds2afq1arm61347504750138
nucleo_wba65ri/stm32wba65xx/nsarm61347804780135
olimex_stm32_p405/stm32f405xxarm61348404840129
stm32f3_disco@E/stm32f303xcarm61343104310182
stm32u083c_dk/stm32u083xxarm61340604060207
verdin_am62/am6234/m4arm61343704370176
actinius_icarus_som/nrf9160/nsarm61245004500162
cc1352r_sensortag/cc1352rarm61246304630149
ensemble_e1c_dk/ae1c1f4051920ph0/rtss_hearm61246204620150
ensemble_e8_dk/ae402fa0e5597le0/rtss_hearm61246204620150
ensemble_e8_dk/ae402fa0e5597le0/rtss_hparm61246204620150
ensemble_e8_dk/ae612fa0e5597ls0/rtss_hearm61246204620150
ensemble_e8_dk/ae612fa0e5597ls0/rtss_hparm61246204620150
ensemble_e8_dk/ae822fa0e5597ls0/apssarm61235303530259
ensemble_e8_dk/ae822fa0e5597ls0/rtss_hearm61246204620150
ensemble_e8_dk/ae822fa0e5597ls0/rtss_hparm61246204620150
lp_am243/am2434/m4arm61242904290183
lp_am243/am2434/r5f0_0arm61240604060206
phyboard_electra/am6442/m4arm61242904290183
phyboard_lyra/am6234/m4arm61243704370175
raytac_mdbt53_db_40/nrf5340/cpunetarm61242804280184
sk_am62/am6254/m4arm61243704370175
sk_am64/am6442/m4arm61242904290183
twr_kv58f220m/mkv58f24arm61247904790133
cc1352r1_launchxl/cc1352rarm61146504650146
gd32e507v_start/gd32e507arm61146404640147
mec172xevb_assy6906/mec172x_nszarm61141404140197
cc26x2r1_launchxl/cc2652rarm61046104610149
degu_evk/nrf52840arm61047604760134
lpcxpresso54114/lpc54114/m4arm61045704570153
mini_stm32h750/stm32h750xxarm61045904590151
usb2canfdv1/stm32g0b1xxarm61041104110199
imx952_evk/mimx9529/m7/ddrarm61046004600150
blueclover_plt_demo_v2/nrf52832arm60944904490160
candlelightfd/stm32g0b1xx/dualarm60941004100199
candlelightfd/stm32g0b1xxarm60941004100199
ctcc/nrf52840arm60948404840125
usbcanfd_dual/stm32g473xxarm60944204420167
mr_navq95b/mimx9596/m7/ddrarm60947104710138
bbc_microbit_v2/nrf52833arm60844604460162
bl654_dvk/nrf52840/paarm60848504850123
bl654_dvk/nrf52840arm60848504850123
canbridge_g473/stm32g473xxarm60844104410167
ek_ra4m2/r7fa4m2ad3cfparm60846004600148
frdm_mcxa344/mcxa344arm60842304230185
lpcxpresso54628/lpc54628arm60846604660142
bl652_dvk/nrf52832arm60744704470160
cc1352p1_launchxl/cc1352parm60746004600147
mimxrt1160_evk/mimxrt1166/cm4arm60742104210186
mimxrt1170_evk@A/mimxrt1176/cm4arm60742604260181
raytac_mdbt53v_db_40/nrf5340/cpunetarm60742704270180
b_g474e_dpow1/stm32g474xxarm60646504650141
cc1312r1_launchxl/cc1312rarm60645904590147
imx93_evk/mimx9352/m33arm60643404340172
lora_e5_mini/stm32wle5xxarm60642804280178
nrf52840_papyr/nrf52840arm60648504850121
ubx_evkninab5/mcxw716carm60646904690137
fpb_ra4e1/r7fa4e10d2cfmarm60545604560149
voice_ra4e1/r7fa4e10d2cnearm60546004600145
adafruit_feather_nrf52840/nrf52840/sense/uf2arm60448004800124
adafruit_feather_nrf52840/nrf52840/sensearm60448104810123
adafruit_feather_nrf52840/nrf52840/uf2arm60448004800124
adafruit_feather_nrf52840/nrf52840arm60448104810123
gd32f403z_eval/gd32f403arm60444704470157
lpcxpresso51u68/lpc51u68arm60438103810223
slwrb4180b/efr32mg21a020f1024im32arm60447904790125
stm32h745i_disco/stm32h745xx/m4arm60442704270177
weact_stm32g0b1_core/stm32g0b1xxarm60442104210183
beagleplay/cc1352p7arm60347004700133
imx943_evk/mimx94398/m7_0arm60345404540149
numaker_m2l31ki/m2l31xxxarm60344204420161
imx943_evk/mimx94398/m7_1arm60245304530149
samd21_xpro/samd21j18aarm60237503750227
gd32e507z_eval/gd32e507arm60146104610140
olimex_stm32_h405/stm32f405xxarm60147204720129
olimex_stm32_h407/stm32f407xxarm60147204720129
pandora_stm32l475/stm32l475xxarm60146404640137
versal_rpu/versal_rpuarm60143504350166
zynqmp_rpu/zynqmp_rpuarm60144604460155
nrf52840_mdk/nrf52840arm60048204820118
phyboard_polis/mimx8mm6/m4arm60040904090191
intel_ish_5_8_0/intel_ish_5_8_0x8660044404440156
kit_psc3m5_cc2/psc3m5fds2afq1arm59946204620137
npcx4m8f_evb/npcx4m8farm59944304430156
sr100_rdk/sr100arm59943904390160
kit_psc3m5_evk/psc3m5fds2afq1/norflasharm59845604560142
max32666evkit/max32666/cpu1arm59847304730125
numaker_pfm_m487/m487arm59846304630135
rzg3e_smarc/r9a09g047e57gbg/cm33arm59842804280170
rzn2h_evb/r9a09g087m44gbg/cr52_0arm59840404040194
rzt2h_evb/r9a09g077m44gbg/cr52_0arm59840404040194
thingy52/nrf52832arm59845104510147
circuitdojo_feather/nrf9160/nsarm59745104510146
max32655evkit/max32655/m4arm59743904390158
sparkfun_thing_plus/nrf9160/nsarm59745204520145
v2m_musca_b1/musca_b1arm59743104310166
mps4/corstone315/fvparm59749504950102
actinius_icarus_som/nrf9160arm59644904490147
nucleo_g070rb/stm32g070xxarm59638703870209
rcar_spider_s4/r8a779f0/r52arm59640204020194
saml21_xpro/saml21j18barm59637003700226
slwrb4180a/efr32mg21a020f1024im32arm59647504750121
sparrowhawk_rcar_v4h/r8a779g0/r52arm59640104010195
steval_fcu001v1/stm32f401xcarm59642904290167
stm32f411e_disco@D/stm32f411xearm59646304630133
stm32h747i_disco/stm32h747xx/m4arm59644804480148
rpi_pico2/rp2350a/hazard3_0riscv59640604060190
decawave_dwm1001_dev/nrf52832arm59544204420153
mps3/corstone300/fvparm59546004600135
npcx9m6f_evb/npcx9m6farm59442904290165
nucleo_h7s3l8/stm32h7s3xx/ext_flash_apparm5944990499095
samr34_xpro/samr34j18barm59436803680226
stm32f411e_disco@B/stm32f411xearm59446104610133
arduino_due/sam3x8earm59342604260167
ctcc/nrf9161arm59346604660127
ensemble_e8_ak/ae822fa0e5597bs0/apssarm59335303530240
ensemble_e8_ak/ae822fa0e5597bs0/rtss_hearm59346204620131
ensemble_e8_ak/ae822fa0e5597bs0/rtss_hparm59346204620131
rm126x_dvk_rm1261/efr32bg22c224f512im40arm59340304030190
rm126x_dvk_rm1262/efr32bg22c224f512im40arm59340304030190
rtl8752h_evb/rtl8752hjlarm59339303930200
stm32h757i_eval/stm32h757xx/m4arm59344704470146
stm32l476g_disco/stm32l476xxarm59345704570136
v2m_beetle/beetle_r0arm59342204220171
lpcxpresso55s06/lpc55s06arm59247204720120
nucleo_l432kc/stm32l432xxarm59244904490143
sama5d27_som1_ek1/sama5d27som1arm59234903490243
samc21n_xpro/samc21n18aarm59237503750217
stm32h7_hdmi_board/stm32h747xx/m4arm59244204420150
qemu_malta/qemu_malta/bemips59244804480144
ek_ra4l1/r7fa4l1bd4cfparm59142704270164
mps2/an500arm59140504050186
slwrb4104a/efr32bg13p632f512gm48arm59144604460145
slwrb4255a/efr32fg13p233f512gm48arm59144604460145
adafruit_trrs_trinkey/samd21e18aarm59035303530237
mimxrt1015_evk/mimxrt1015arm59042604260164
mps2/an386arm59044004400150
rtl8752h_evb/rtl8752hjfarm59038303830207
rtl8752h_evb/rtl8752hkfarm59038303830207
rtl8752h_evb/rtl8752hmfarm59038303830207
tyzs3/efr32mg13p732f512gm48arm59044504450145
frdm_ke17z/mke17z7arm58937303730216
max78000evkit/max78000/m4arm58941504150174
mercury_xu/zynqmp_rpuarm58942604260163
nucleo_u083rc/stm32u083xxarm58937303730216
opi_zero/sun8i_h3arm58935103510238
scobc_a1@2.0.0/designstart_fpga_cortex_m3arm58939703970192
stm32f3_seco_d23/stm32f302xcarm58940104010188
balletto_b1_sk/ab1c1f4m51820ph0arm58846104610127
cyclonev_socdk/cyclonevarm58835003500238
ek_ra4w1/r7fa4w1ad2cngarm58843504350153
max32680evkit/max32680/m4arm58842104210167
mcx_n5xx_evk/mcxn547/cpu0/nsarm58846204620126
mcx_n9xx_evk/mcxn947/cpu0/nsarm58846204620126
pico_ultra/rv1106arm58835003500238
twr_ke18f/mke18f16arm58840904090179
yd_stm32h750vb/stm32h750xxarm58844604460142
beetle_rp2350/rp2350a/hazard3_0riscv58839103910197
fk750m1_vbt6/stm32h750xxarm58745004500137
fk7b0m1_vbt6/stm32h7b0xxarm58744904490138
frdm_imx93/mimx9352/m33arm58743204320155
frdm_mcxn947/mcxn947/cpu0/nsarm58745704570130
motion_2350_pro/rp2350a/hazard3_0riscv58739003900197
bcm958401m2/bcm58400arm58639303930193
bcm958402m2/bcm58402/m7arm58639703970189
ctcc/nrf9161/nsarm58645204520134
ensemble_e1c_sk/ae1c1f4051920ph0/rtss_hearm58645904590127
mec172xmodular_assy6930/mec172x_nszarm58640304030183
sparkfun_thing_plus/nrf9160arm58644904490137
qemu_riscv32/qemu_virt_riscv32/smpriscv5865130513073
rp2350_zero/rp2350a/hazard3_0riscv58638603860200
xiao_rp2350/rp2350a/hazard3_0riscv58639503950191
cy8ckit_062s4/cy8c6244lqi_s4d92arm58542504250160
google_twinkie_v2/stm32g0b1xxarm58540304030182
nucleo_g431rb/stm32g431xxarm58539803980187
nucode_nu32/nrf52832arm58544804480137
sam4l_wm400_cape/sam4lc4barm58539203920193
stm32f103_mini/stm32f103xearm58537003700215
circuitdojo_feather/nrf9160arm58444604460138
pico_plus2/rp2350b/hazard3_0riscv58438903890195
rp2350b_core/rp2350b/hazard3_0riscv58440504050179
rp2350b_plus_w/rp2350b/hazard3_0riscv58439303930191
intel_btl_s_crb@H/raptor_lakex8658342304230160
dect_nr_plus_usb_dongle/nrf9151/nsarm58344904490134
frdm_mcxn236/mcxn236/nsarm58344604460137
nucleo_c092rc/stm32c092xxarm58336303630220
frdm_imx93/mimx9352/a55/smparm6458342604260157
nucleo_c071rb/stm32c071xxarm58236703670215
nucleo_l073rz/stm32l073xxarm58236503650217
adp_xc7k/ae350riscv58243804380144
imx8mp_var_dart/mimx8ml8/m7arm58143004300151
imx93_var_dart/mimx9352/m33arm58143204320149
imx93_var_som/mimx9352/m33arm58143204320149
pic32cm_jh01_cnano/pic32cm5164jh01048arm58141704170164
sam4l_ek/sam4lc4carm58137703770204
stm32h7s78_dk/stm32h7s7xx/ext_flash_apparm5814980498083
intel_rpl_p_crb/raptor_lakex8658042004200160
ek_ra4c1/r7fa4c1bd3cfparm58043004300150
frdm_mcxa153/mcxa153arm58038103810199
nucleo_wl33cc1/stm32wl33xxarm58036903690211
numaker_m031ki/m031xxxarm58039903990181
quick_feather/quicklogic_eos_s3arm58042304230157
adp_xc7k/ae350/clicriscv58043304330147
imx8mp_evk/mimx8ml8/m7arm57942704270152
serpente/samd21e18aarm57935403540225
nrf54h20dk@0.9.0/nrf54h20/cpupprriscv57931603160263
qomu/quicklogic_eos_s3arm57842104210157
seeeduino_xiao/samd21g18aarm57836203620216
sparkfun_samd21_breakout/samd21g18aarm57836303630215
cy8cproto_041tp/cy8c4147azq_t495arm57635603560220
nucleo_f410rb/stm32f410rxarm57638003800196
pan1781_evb/nrf52820arm57638203820194
we_orthosie1ev/esp32c3riscv57639403940182
weact_esp32c3_mini/esp32c3riscv57639603960180
holyiot_yj16019/nrf52832arm5750000575
holyiot_yj17095/nrf52832arm57542804280147
esp32c3_lckfb/esp32c3riscv57539303930182
intel_adl_crb/alder_lakex8657441804180156
phyboard_pollux/mimx8ml8/m7arm57442604260148
verdin_imx8mp/mimx8ml8/m7arm57442804280146
frdm_imx93/mimx9352/a55arm6457440504050169
npcx7m6fb_evb/npcx7m6fbarm57341904190154
nucleo_l412rb_p/stm32l412xxarm57339103910182
phyboard_nash/mimx9352/m33arm57343004300143
vmu_rt1170/mimxrt1176/cm4arm57341404140159
imx8mp_var_som/mimx8ml8/m7arm57242704270145
m1s_dock/bl808c09q2iriscv57240504050167
samd20_xpro/samd20j18arm57136003600211
v2m_musca_b1/musca_b1/nsarm57140104010170
heltec_wifi_lora32_v3/esp32s3/procpuxtensa57139203920179
lp_am13e230/am13e23019arm57042004200150
nrf7002dk/nrf5340/cpunetarm57042704270143
stm32mp157x_dk2/stm32mp157cxxarm57029602960274
arduino_nesso_n1/esp32c6/hpcoreriscv57042904290141
beetle_esp32c3@1.0.0/esp32c3riscv57039303930177
beetle_esp32c3@2.0.0/esp32c3riscv57039303930177
arduino_mkrzero/samd21g18aarm56936403640205
arduino_zero/samd21g18aarm56936403640205
crd40l50/stm32f401xdarm56937303730196
eurovibes_stm32g431_sertest-ng/stm32g431xxarm56932603260243
gd32a503v_eval/gd32a503arm56939703970172
nrf52832_mdk/nrf52832arm56944304430126
stm32mp157x_dk2/stm32mp157fxxarm56929402940275
te0950/versal_rpuarm56930703070262
thingy53/nrf5340/cpunetarm56940604060163
frdm_mcxc444/mcxc444arm56936503650204
esp32c3_luatos_core/esp32c3/usbriscv56939303930176
esp32c3_luatos_core/esp32c3riscv56939303930176
esp32c3_supermini/esp32c3riscv56939303930176
heltec_wireless_stick_lite_v3/esp32s3/procpuxtensa56939003900179
crd40l26/stm32f401xdarm56837403740194
frdm_mcxn947/mcxn947/cpu1arm56839103910177
lpcxpresso55s69/lpc55s69/cpu0/nsarm56838803880180
mcx_n5xx_evk/mcxn547/cpu1arm56839103910177
mcx_n9xx_evk/mcxn947/cpu1arm56839103910177
pan1783_evb/nrf5340/cpunetarm56840604060162
pan1783a_evb/nrf5340/cpunetarm56840604060162
pan1783a_pa_evb/nrf5340/cpunetarm56840604060162
acn52832/nrf52832arm56744304430124
arduino_nano_33_iot/samd21g18aarm56736303630204
dect_nr_plus_usb_dongle/nrf9151arm56744804480119
nrf52_adafruit_feather/nrf52832arm56744304430124
nrf52_blenano2/nrf52832arm56744304430124
nrf52_sparkfun/nrf52832arm56744304430124
nrf52_vbluno52/nrf52832arm56743204320135
raytac_an7002q_db/nrf5340/cpunetarm56742504250142
adafruit_trinket_m0/samd21e18aarm56636203620204
pinetime_devkit0/nrf52832arm56644304430123
imx93_evk/mimx9352/a55/smparm6456641904190147
core2350b/rp2350b/hazard3_0riscv56639103910175
generic_leon3/leon3sparc56640904090157
ttgo_t8c3/esp32c3riscv56640004000166
ttgo_toiplus/esp32c3riscv56640004000166
kb1062_evb/kb1062arm56537803780187
kb1200_evb/kb1200arm56539903990166
nrf5340_audio_dk/nrf5340/cpunetarm56542304230142
verdin_imx8mm/mimx8mm6/m4arm56540404040161
versalnet_rpu/amd_versalnet_rpuarm56542004200145
imx93_evk/mimx9352/a55arm6456540204020163
imx8mm_evk/mimx8mm6/m4arm56440304030161
imx8mq_evk/mimx8mq6/m4arm56440304030161
tdongle_s3/esp32s3/procpuxtensa56438103810183
npck3m8k_evb/npck3m8karm56342504250138
adafruit_qt_py_esp32s3/esp32s3/procpuxtensa56337803780185
adafruit_qt_py_esp32s3@psram/esp32s3/procpuxtensa56337803780185
xiao_esp32c3/esp32c3riscv56339703970166
max32662evkit/max32662arm56231203120250
mec15xxevb_assy6853/mec1501_hszarm56235603560206
rza3ul_smarc/r9a07g063u02gbgarm6456240104010161
ttgo_t8s3/esp32s3/procpuxtensa56237903790183
twatch_s3/esp32s3/procpuxtensa56239303930169
weact_esp32s3_b/esp32s3/procpuxtensa56237703770185
weact_esp32s3_mini/esp32s3/procpuxtensa56237703770185
mec_assy6941/mec1753_qljarm56137503750186
stm3210c_eval/stm32f107xcarm56137803780183
versal2_rpu/amd_versal2_rpuarm56141704170144
aipi_eyes_s2/bl618m05q2iriscv56139403940167
it82xx2_evb/it82202axriscv56138803880173
lpcxpresso55s69/lpc55s69/cpu1arm56036703670193
mec_assy6941/mec1743_qljarm56037503750185
nucleo_h503rb/stm32h503xxarm56039003900170
stm32l152c_disco/stm32l152xcarm56034903490211
qcc744m_evk/bl618m05q2iriscv56038803880172
t_deck@plus/esp32s3/procpuxtensa56039403940166
t_deck@standard/esp32s3/procpuxtensa56039203920168
mec_assy6941/mec1743_qszarm55937103710188
mec_assy6941/mec1753_qszarm55937203720187
ubx_bmd360eval/nrf52811arm55935603560203
ubx_bmd330eval/nrf52810arm55835503550203
qemu_cortex_a53/qemu_cortex_a53/smparm645584690469089
adafruit_feather_esp32s3_tft_reverse/esp32s3/procpuxtensa55837603760182
b_l072z_lrwan1/stm32l072xxarm55734303430214
m2s010_mkr_kit/m2s010arm55737503750182
m2s_hello_fpga_kit/m2s010arm55737503750182
mec1501modular_assy6885/mec1501_hszarm55734703470210
adafruit_feather_esp32s3/esp32s3/procpuxtensa55737703770180
adafruit_feather_esp32s3_tft/esp32s3/procpuxtensa55737603760181
m5stack_cores3/esp32s3/procpuxtensa55737903790178
nrf7120dk/nrf7120/cpuflprriscv55736803680189
qemu_arc/qemu_arc_hsarc55744004400117
xiao_esp32s3/esp32s3/procpuxtensa55737903790178
ev11l78a/samd20e16arm55618501850371
msp_exp432p401r_launchxl/msp432p401rarm55639603960160
intel_adsp/ace15_mtpm/simxtensa55642904290127
m5stack_cores3/esp32s3/procpu/sextensa55637503750181
walter/esp32s3/procpuxtensa55637403740182
esp32s3_luatos_core/esp32s3/procpu/usbxtensa55537903790176
esp32s3_luatos_core/esp32s3/procpuxtensa55538103810174
xiao_esp32s3/esp32s3/procpu/sensextensa55537603760179
bl706_iot_dvk/bl706c00q2iriscv55438303830171
dt_xt_zb1_devkit/bl702c10q2hriscv55438803880166
esp32c3_042_oled/esp32c3riscv55438603860168
rv32m1_vega/openisa_rv32m1/ri5cyriscv55440304030151
olimexino_stm32/stm32f103xbarm55333603360217
reterminal_e1002/esp32s3/procpuxtensa55338603860167
ttgo_lora32/esp32/procpuxtensa55341504150138
m5stack_paper_color/esp32s3/procpuxtensa55238103810171
stamp_c3/esp32c3riscv55238503850167
intel_ehl_crb/elkhart_lakex8655142504250126
lp_mspm0g3507/mspm0g3507arm55135603560195
mikroe_clicker_ra4m1/r7fa4m1ab3cfmarm55135403540197
rm1xx_dvk/nrf51822arm55136303630188
stm32g071b_disco/stm32g071xxarm55134703470204
nucleo_f070rb/stm32f070xbarm55032203220228
ronoth_lodev/stm32l073xxarm55032303230227
tq_h503a/stm32h503xxarm55037903790171
can485dbv1/esp32/procpuxtensa55040604060144
esp32_cam/esp32/procpuxtensa55040404040146
ganymed_bob/sy120_gbmriscv55037003700180
ganymed_bob/sy120_gen1riscv55037003700180
ganymed_sk/sy120_gbmriscv55037203720178
nrf93m1dk@0.4.0/nrf54l15/cpuflpr/xipriscv55036203620188
qemu_riscv64/qemu_virt_riscv64/opensbi_smpriscv55043604360114
intel_wcl_crb/wildcat_lakex8654942204220127
nucleo_g431kb/stm32g431xxarm54937403740175
ganymed_sk/sy120_gen1riscv54937103710178
m0sense/bl702sa0q2iriscv54938503850164
nrf7120dk/nrf7120e/cpuflprriscv54935903590190
olimex_esp32_evb/esp32/procpuxtensa54940504050144
qemu_arc/qemu_arc_hs6xarc54939703970152
cy8ckit_041s_max/cy8c4149azi_s598arm54834603460202
nrf9280pdk@0.2.0/nrf9280/cpuradarm54841004100138
nucleo_f302r8/stm32f302x8arm54832103210227
lolin32_lite/esp32/procpuxtensa54839703970151
qemu_arc/qemu_arc_hs/xiparc54842704270121
stm32_min_dev@blue/stm32f103x8arm54732703270220
mps4/corstone320/fvparm54744104410106
adafruit_feather_esp32s2_tft/esp32s2xtensa54737403740173
adafruit_feather_esp32s2_tft_reverse/esp32s2xtensa54737403740173
doit_esp32_devkit_v1/esp32/procpuxtensa54739703970150
up_squared_pro_7000/alder_lakex8654642504250121
arduino_nano_r4/r7fa4m1ab3cfmarm54635403540192
arduino_uno_r4@minima/r7fa4m1ab3cfmarm54635603560190
arduino_uno_r4@wifi/r7fa4m1ab3cfmarm54635603560190
rh02_plus_2026/stm32g431xxarm54630503050241
imx8mp_evk/mimx8ml8/a53arm6454639403940152
3r_tnh_sensor_lite/bl704l10q2iwriscv54637103710175
heltec_wireless_tracker/esp32s3/procpuxtensa54638603860160
m5stack_stackchan/esp32s3/procpuxtensa54637903790167
ophelia4ev/nrf54l15/cpuflprriscv54634503450201
uedx24320028e_wb_a/esp32s3/procpuxtensa54637903790167
uedx32480035e_wb_a/esp32s3/procpuxtensa54637903790167
nucleo_f103rb/stm32f103xbarm54534903490196
adafruit_feather_esp32s2@B/esp32s2xtensa54537403740171
adafruit_feather_esp32s2@C/esp32s2xtensa54537403740171
nrf93m1dk@0.4.0/nrf54l15/cpuflprriscv54534003400205
qemu_riscv64/qemu_virt_riscv64/smoderiscv54542204220123
yd_esp32/esp32/procpuxtensa54539603960149
lp_mspm0l2228/mspm0l2228arm54434103410203
lpcxpresso11u68/lpc11u68arm54434103410203
mks_canable_v20/stm32g431xxarm54428302830261
nucleo_f072rb/stm32f072xbarm54431603160228
stg_800/stm32f091xcarm54436103610183
usbcanfd_solo/stm32g431xxarm54430403040240
adafruit_feather_esp32@2/esp32/procpuxtensa54439303930151
m5stack_atoms3_lite/esp32s3/procpuxtensa54437403740170
intel_rpl_s_crb@600/raptor_lakex8654341504150128
cv32a6_genesys_2/cv32a6riscv54338003800163
esp_threadbr/esp32s3/procpuxtensa54337303730170
qemu_arc/qemu_arc_hs5xarc54340204020141
intel_nvl_s_rvp/nova_lakex8654241504150127
mps3/corstone300/an547arm54244204420100
usb2canfdv2/stm32g431xxarm54236203620180
bl54l15_dvk/nrf54l15/cpuflpr/xipriscv54235703570185
cv64a6_genesys_2/cv64a6riscv54237803780164
nrf54l15tag/nrf54l15/cpuflprriscv54232103210221
nrf7120dk/nrf7120/cpuflpr/xipriscv54236303630179
nrf7120dk/nrf7120e/cpuflpr/xipriscv54236203620180
panb611evb/nrf54l15/cpuflprriscv54233803380204
qemu_xtensa/dc233cxtensa54242504250117
xiao_nrf54l15/nrf54l15/cpuflprriscv54232203220220
qemu_riscv64/qemu_virt_riscv64/smpriscv5414630463078
raytac_an54lq_db_15/nrf54l15/cpuflpr/xipriscv54135603560185
raytac_an54lv_db_15/nrf54l15/cpuflpr/xipriscv54135603560185
apex_pro_mini/stm32l412xxarm54035003500190
ek_ra4e2/r7fa4e2b93cfmarm54037603760164
slwrb4250b/efr32fg1p133f256gm48arm54037903790161
frdm_k32l2b3/k32l2b31aarm54033703370203
imx952_evk/mimx9529/a55arm6454039003900150
gr716a_mini/gr716asparc54034203420198
nrf54l15dk/nrf54l15/cpuflpr/xipriscv54035803580182
panb611evb/nrf54l15/cpuflpr/xipriscv54035403540186
ek_ra6e2/r7fa6e2bb3cfmarm53937903790160
nrf54l15tag/nrf54l15/cpuflpr/xipriscv53933803380201
fpb_ra6e2/r7fa6e2bb3cfmarm53837803780160
stm32_min_dev@black/stm32f103x8arm53831803180220
stm32f072b_disco/stm32f072xbarm53831703170221
qemu_riscv32/qemu_virt_riscv32/aia-direct/smpriscv5384630463075
riscv32_virtual/riscv_virtual_renoderiscv53839803980140
ttgo_tbeam/esp32/procpuxtensa53840204020136
ubx_evknorab2/nrf54l15/cpuflpr/xipriscv53835403540184
art_pi2/stm32h7r7xxarm53730703070230
stm32g081b_eval/stm32g081xxarm53735103510186
it51xxx_evb/it51526awriscv53737203720165
m5stack_core2/esp32/procpuxtensa53739903990138
qemu_malta/qemu_maltamips53739903990138
intel_ptl_h_crb/panther_lakex8653641204120124
ec4l15ba1/nrf54l15/cpuflpr/xipriscv53635303530183
nsim_arc_v/rhx100riscv5364380438098
arty_a7/designstart_fpga_cortex_m1arm53533703370198
slstk3401a/efm32pg1b200f256gm48arm53537103710164
esp32s3_touch_lcd_1_28/esp32s3/procpuxtensa53537403740161
nrf54h20dk@0.9.0/nrf54h20/cpuflprriscv53520602060329
qemu_xtensa/sample_controller32/mpuxtensa5354440444091
mps3/corstone300/an552arm53442804280106
frdm_mcxc242/mcxc242arm53431303130221
imx8mm_evk/mimx8mm6/a53arm6453438203820152
imx8mn_evk/mimx8mn6/a53arm6453438203820152
glyph_c6/esp32c6/hpcoreriscv53440504050129
linkw/ch32v208riscv53435103510183
m5stack_atoms3/esp32s3/procpuxtensa53437503750159
m5stack_fire/esp32/procpuxtensa53439503950139
m5stack_stamps3/esp32s3/procpuxtensa53437303730161
rak3112/esp32s3/procpuxtensa53437103710163
ek_ra2a1/r7fa2a1ab3cfmarm53335803580175
ek_ra4m1/r7fa4m1ab3cfparm53336503650168
mck_ra4t1/r7fa4t1bb3cfmarm53336803680165
nrf51_ble400/nrf51822arm53334203420191
imx91_evk/mimx9131arm6453338103810152
m5stickc_plus/esp32/procpuxtensa53339503950138
ttgo_t7v1_5/esp32/procpuxtensa53339303930140
beaglebone_ai64/j721e/main_r5f0_0arm53233303330199
frdm_kl25z/mkl25z4arm53231203120220
qemu_riscv32/qemu_virt_riscv32/aia-imsic/smpriscv5324590459073
m5stack_atom_lite/esp32/procpuxtensa53139103910140
odroid_go/esp32/procpuxtensa53139603960135
rv32m1_vega/openisa_rv32m1/zero_riscyriscv53137803780153
fvp_base_revc_2xaem/v8a_aarch32arm53036303630167
udoo_neo_full/mcimx6x/m4arm53035003500180
usb_kw24d512/mkw24d5arm53035803580172
egis_et171/et171riscv53041004100120
esp32p4_wifi6/esp32p4/hpcoreriscv53037603760154
inkplate_6color/esp32/procpuxtensa53039203920138
gd32e103v_eval/gd32e103arm52934703470182
sim3u1xx_dk/sim3u167arm52935303530176
frdm_imx91/mimx9131arm6452940004000129
imx95_evk/mimx9596/a55/smparm6452939603960133
frdm_mcxl255/mcxl255/cpu1arm528570570471
sgrm/sim3u167arm52835003500178
stm32l1_disco/stm32l151xbarm52830803080220
pocketbeagle_2@A1/am6232/a53arm6452839403940134
pocketbeagle_2@A1/am6254/a53arm6452839503950133
pocketbeagle_2_industrial@A1/am6254/a53arm6452839503950133
ch32v305f_evt_r0/ch32v305riscv52832903290199
hifive_unmatched/fu740/u74riscv52839603960132
rsk_rx130@512kb/r5f51308axfprx52834203420186
weact_ra4m1_core/r7fa4m1ab3cfmarm52735403540173
titanium_ti60_f225/efinix_sapphireriscv52736703670160
rza3m_ek/r9a07g066m04gbgarm6452637903790147
ad_swiot1l_sl/max32650arm52536503650160
max32660evsys/max32660arm52536503650160
xiao_ra4m1/r7fa4m1ab3cnearm52535403540171
ch32h417evt/ch32h417/v5friscv52537603760149
esp32s3_rlcd_4_2/esp32s3/procpuxtensa52537603760149
m2gl025_miv/mivriscv52539303930132
tang_mega_138k_pro_dock/ae350/demoriscv52540804080117
stm32373c_eval/stm32f373xcarm52436203620162
we_ophelia1ev/nrf52805arm52433603360188
em_starterkit@2.2.0/emsk_em7darc52436303630161
hifive_unmatched/fu740/s7riscv52439103910133
em_starterkit@2.3.0/emsk_em11darc52334503450178
em_starterkit@2.3.0/emsk_em7darc52336603660157
em_starterkit@2.3.0/emsk_em9darc52334703470176
gd32vf103v_eval/gd32vf103riscv52333903390184
96b_wistrio/stm32l151xbaarm52234903490173
e80_900mbl_01/stm32f103x8arm52231303130209
mec_assy6941/mec1653b_nszarm52235903590163
gd32vf103c_starter/gd32vf103riscv52131603160205
legend@25hdd/stm32f070xbarm52030103010219
legend@25ssd/stm32f070xbarm52030003000220
legend@35/stm32f070xbarm52030103010219
nucleo_l552ze_q/stm32l552xx/nsarm52010401040416
osd32mp1_brk/osd32mp15xarm52028402840236
max32655fthr/max32655/rv32riscv52035103510169
max32690evkit/max32690/rv32riscv52037503750145
intel_adl_rvp/alder_lakex8651940204020117
96b_avenger96/stm32mp157cxxarm51928402840235
frdm_ke15z/mke15z7arm51934603460173
hifive_unleashed/fu540/u54riscv51939203920127
qemu_arc/qemu_arc_emarc51940304030116
bbc_microbit/nrf51822arm51830903090209
up_squared/apollo_lakex8651739903990118
96b_carbon/nrf51822arm51734103410176
nrf51dongle/nrf51822arm51735003500167
aries_v3/thejas32riscv51737003700147
hifive_unleashed/fu540/e51riscv51738703870130
niosv_g/niosv_griscv51737003700147
niosv_m/niosv_mriscv51737003700147
nrf54h20dk@0.9.0/nrf54h20/cpuflpr/xipriscv51730003000217
beaglebone_ai64/j721e/main_r5f0_1arm51631603160200
beaglebone_ai64/j721e/main_r5f1_0arm51631603160200
beaglebone_ai64/j721e/main_r5f1_1arm51631603160200
beaglebone_ai64/j721e/mcu_r5f0_0arm51631603160200
beaglebone_ai64/j721e/mcu_r5f0_1arm51631603160200
beagley_ai/j722s/main_r5f0_0arm51633303330183
beagley_ai/j722s/mcu_r5f0_0arm51633303330183
tm4c123gxl/ti_tm4c123gh6pmarm51634403440172
acrn_ehl_crb/atomx8651639603960120
esp32s3_geek/esp32s3/procpuxtensa51637203720144
kincony_kc868_a32/esp32/procpuxtensa51638503850131
qemu_riscv32/qemu_virt_riscv32/aia-directriscv5164370437079
adafruit_feather_m0_basic_proto/samd21g18aarm51534703470168
mps3/an536/cpu0arm51538403840131
nrf51_vbluno51/nrf51822arm51533903390176
t3_gem_o1/j722s/main_r5f0_0arm51533203320183
t3_gem_o1/j722s/mcu_r5f0_0arm51533203320183
it8xxx2_evb/it81302bxriscv51534303430172
nrf54lm20dk/nrf54lm20a/cpuflprriscv51534703470168
nrf54lm20dk/nrf54lm20b/cpuflprriscv51534703470168
nsim/nsim_hs6x_smp/12coresarc51540004000115
qemu_riscv64/qemu_virt_riscv64/opensbiriscv51539603960119
adafruit_feather_m0_lora/samd21g18aarm51434603460168
gd32l233r_eval/gd32l233arm51433603360178
sk_am64/am6442/r5f0_0arm51431603160198
sk_am64/am6442/r5f0_1arm51431603160198
sk_am64/am6442/r5f1_0arm51431603160198
sk_am64/am6442/r5f1_1arm51431603160198
fvp_corstone1000/a320arm6451441204120102
esp32s3_box3/esp32s3/procpuxtensa51436903690145
arty_a7/designstart_fpga_cortex_m3arm51318301830330
ek_ra2l1/r7fa2l1abxxfparm51334903490164
ch32v303vct6_evt/ch32v303riscv51332303230190
dnesp32s3b/esp32s3/procpuxtensa51336903690144
nrf54h20dk@0.9.0/nrf54h20/cpuppr/xipriscv51333103310182
qemu_riscv32/qemu_virt_riscv32/aia-imsicriscv5134340434079
efm32wg_stk3800/efm32wg990f256arm51236703670145
mks_canable_v10/stm32f072x8arm51229502950217
rssk_ra2l1/r7fa2l1abxxfparm51234603460166
ucan/stm32f072xbarm51229902990213
usbcan_iso/stm32f072xbarm51229902990213
esp32c6_devkitc/esp32c6/hpcore/qemuriscv51239703970115
glyph_c3/esp32c3riscv51237903790133
glyph_h2/esp32h2riscv51239903990113
m5stack_sticks3/esp32s3/procpuxtensa51236703670145
candlelight/stm32f072xbarm51129902990212
rh02/stm32f072xbarm51129502950216
esp32c3_devkitc/esp32c3/qemuriscv51137603760135
esp32c6_lcd_1_47/esp32c6/hpcoreriscv51140404040107
heltec_wifi_lora32_v2/esp32/procpuxtensa51138603860125
mpfs_icicle/polarfire/u54riscv51137103710140
faze/lpc11u67arm51029202920218
warp7/mcimx7d/m4arm51019101910319
intel_ish_5_4_1/intel_ish_5_4_1x8651036003600150
intel_ish_5_6_0/intel_ish_5_6_0x8651036003600150
fs_i6s/stm32f072xbarm50929902990210
imx8mp_var_dart/mimx8ml8/a53arm6450938003800129
imx93_var_dart/mimx9352/a55arm6450937903790130
imx93_var_som/mimx9352/a55arm6450937903790130
acrn/atomx8650939803980111
acrn_adl_crb/atomx8650937703770132
apard32690@D/max32690/rv32riscv50937203720137
imx8mm_evk/mimx8mm6/a53/smparm6450839803980110
imx8mn_evk/mimx8mn6/a53/smparm6450839803980110
imx8mp_evk/mimx8ml8/a53/smparm6450839803980110
phyboard_polis/mimx8mm6/a53/smparm6450839803980110
qemu_cortex_a72/bcm2711/smparm645084210421087
qemu_cortex_a72/bcm2711arm6450840604060102
beaglev_fire/polarfire/e51riscv50836403640144
beaglev_fire/polarfire/u54/smpriscv50838103810127
beaglev_fire/polarfire/u54riscv50836803680140
esp32s3_matrix/esp32s3/procpuxtensa50836903690139
intel_ehl_crb/elkhart_lake/sblx8650839003900118
nsim/nsim_hs/sramarc50840404040104
nsim_arc_v/rmx100riscv5084090409099
pic64gx_curiosity_kit/pic64gx1000/e51riscv50838603860122
pic64gx_curiosity_kit/pic64gx1000/u54/smpriscv50840304030105
pic64gx_curiosity_kit/pic64gx1000/u54riscv50839003900118
sparkfun_red_v_things_plus/fe310_g002riscv50812901290379
fvp_base_revc_2xaem/v8a_aarch32/smparm50735903590148
longan_nano/gd32vf103riscv50732903290178
beagleconnect_zepto/mspm0l1117arm50631503150191
bcm958402m2/bcm58402/a72arm6450638103810125
imx95_evk_15x15/mimx9596/a55arm6450637803780128
mpfs_icicle/polarfire/e51riscv50636203620144
visionfive2/jh7110riscv50536103610144
lpcxpresso54114/lpc54114/m0arm50430903090195
tang_mega_138k_pro_dock/ae350riscv50438203820122
nrf52dk/nrf52805arm50334703470156
opi_zero2w/sun50i_h618arm6450338003800123
rcar_spider_s4/r8a779f0/a55arm6450337603760127
fpb_rx261/r5f52618bgfprx50336103610142
icev_wireless/esp32c3riscv50337403740129
mpfs_icicle/polarfire/u54/smpriscv50337603760127
nrf54lv10dk/nrf54lv10a/cpuflprriscv50324702470256
holyiot_21014/nrf52810arm50232303230179
nrf52dk/nrf52810arm50234803480154
mt8370_genio_510_evk/mt8188/a55arm6450237703770125
mt8390_genio_700_evk/mt8188/a55arm6450237703770125
rock_5b_plus/rk3588arm6450237803780124
xenvm/xenvmarm6450237603760126
esp32_devkitc/esp32/procpu/qemuxtensa50239103910111
nsim/nsim_hs5xarc50236903690133
imx8mp_var_som/mimx8ml8/a53arm6450137703770124
imx91_qsb/mimx9111arm6450137603760125
imx952_evk/mimx9529/a55/smparm6450139203920109
ls1046ardb/ls1046aarm6450137703770124
phyboard_polis/mimx8mm6/a53arm6450137603760125
xenvm/xenvm/gicv3arm6450137503750126
ek_rx74m/r5k574mcb4aerx50134503450156
ek_rx74n/r5k574ncb4aerx50134503450156
khadas_edge2/rk3588sarm6450037703770123
khadas_edgev/rk3399arm6450037703770123
ls1046ardb/ls1046a/smp/4coresarm6450039003900110
ls1046ardb/ls1046a/smparm6450038903890111
qnxhv_vm/qnxhv_vmarm6450038203820118
am62l_evm/am62l3/a53arm6449939103910108
dt_bl10_devkit/bl602c20q2iriscv49936503650134
roc_rk3568_pc/rk3568/smparm6449839403940104
rock_3b/rk3568/smparm6449839403940104
max78000fthr/max78000/rv32riscv49834703470151
mcb_rx26t@typeb/r5f526tfddfprx49833503350163
nsim/nsim_hs_smparc49838103810117
opentitan_earlgrey/opentitanriscv49835603560142
fvp_base_revc_2xaem/v9a/smp/nsarm644974070407090
sk_am62/am6254/a53arm6449739603960101
ek_rx261/r5f52618bgfprx49735803580139
max78002evkit/max78002/rv32riscv49736103610136
neorv32/neorv32/minimalbootriscv49730403040193
intel_socfpga_agilex5_socdk/agilex5arm6449639203920104
intel_socfpga_agilex_socdk/agilexarm6449637403740122
sparrowhawk_rcar_v4h/r8a779g0/a76arm6449637503750121
esp32s2_franzininho/esp32s2xtensa49635003500146
neorv32/neorv32/up5kdemoriscv49630803080188
rpi_4b/bcm2711arm6449539403940101
rpi_5/bcm2712/swdarm6449537503750120
rpi_5/bcm2712arm6449537503750120
orangepi_5_ultra_rk3588/rk3588arm6449437503750119
rcar_h3ulcb/r8a77951/a57arm6449437503750119
hsdk/arc_hsdkarc49436303630131
gd32f350r_eval/gd32f350arm49330403040189
phyboard_nash/mimx9352/a55arm6449337203720121
rcar_salvator_xs/r8a77961arm6449337303730120
colibri_imx7d/mcimx7d/m4arm49218101810311
phyboard_lyra/am6234/a53arm6449237203720120
qemu_kvm_arm64/qemu_virt_arm64arm644923960396096
emsdp/emsdp_em11darc49235803580134
esp32s2_lolin_mini/esp32s2xtensa49236503650127
96b_meerkat96/mcimx7d/m4arm49119201920299
roc_rk3568_pc/rk3568arm6449137203720119
rock_3b/rk3568arm6449137203720119
emsdp/emsdp_em6arc49135603560135
emsdp/emsdp_em7d_esparc49135803580133
emsdp/emsdp_em9darc49135503550136
hifive1_revb/fe310_g002riscv49112701270364
qemu_cortex_m0/nrf51822arm49032903290161
iotdk/arc_iotarc49036903690121
rsk_rx140/r5f51406bdfnrx49033803380152
lpc845brk/lpc845arm48930303030186
olimex_stm32_h103/stm32f103xbarm48931403140175
bluepillplus_ch32v203/ch32v203riscv48928102810208
esp32s3_devkitc/esp32s3/procpu/qemuxtensa48936403640125
pico_pi/mcimx7d/m4arm48820202020286
ch32v203c8t6evt@0/ch32v203riscv48827702770211
fpb_rx140/r5f51406bgfnrx48833603360152
hsdk/arc_hsdk/2coresarc48835803580130
intel_adsp/ace15_mtpmxtensa48835603560132
nsim/nsim_emarc48837603760112
kit_t2g_c2d6m_lite/cyt4dnjbzs/m0parm48731403140173
rpi_zero_2w/bcm2710arm6448737103710116
ch32h417evt/ch32h417/v3friscv48732003200167
hsdk4xd/arc_hsdk4xdarc48735903590128
intel_adsp/ace20_lnlxtensa48735403540133
intel_adsp/ace30/ptlxtensa48737503750112
scobc_v1/mivriscv48736603660121
kit_xmc72_evk/xmc7200d_e272k8384/m0parm48521802180267
longan_nano/gd32vf103/literiscv48227002700212
stm32f072_eval/stm32f072xbarm48029602960184
dragino_lsn50/stm32l072xxarm47930903090170
dragino_nbsn95/stm32l072xxarm47930903090170
nrf51_blenano/nrf51822arm47930103010178
emsdp/emsdp_em4arc47931903190160
nsim/nsim_hsarc47937303730106
rcar_ironhide_x5h/r8a78000/a720arm6447837403740104
emsdp/emsdp_em5darc47835303530125
emsdp/emsdp_em7darc47835503550123
fvp_base_revc_2xaem/v8aarm6447736303630114
fvp_base_revc_2xaem/v8a/smparm644763820382094
hifive1/fe310_g000riscv47627302730203
xiao_nrf54lm20a/nrf54lm20a/cpuflprriscv47630503050171
hexiwear/mkw40z4arm47528902890186
nsim/nsim_hs5x_smparc47535703570118
zynqmp_apu/zynqmp_apuarm6447437103710103
nsim/nsim_hs/mpuv6arc47336903690104
elemrv_flask_n/elemrv_nriscv473240240449
nrf54l15dk/nrf54l05/cpuflprriscv472170170455
nsim/nsim_em7d_v22arc47236403640108
nsim/nsim_hs6x_smparc47235103510121
versal2_apu/amd_versal2_apuarm6447136803680103
intel_adsp/ace30/wclxtensa47136303630108
nsim/nsim_hs6xarc47133803380133
imx8mp_evk/mimx8ml8/adspxtensa47033403340136
nsim/nsim_hs5x_smp/12coresarc47036003600110
fvp_base_revc_2xaem/v9aarm6446936703670102
versal_apu/versal_apuarm6446936803680101
ubx_evknorab2/nrf54l05/cpuflprriscv469170170452
zynqmp_apu/zynqmp_apu/smparm644683810381087
fvp_base_revc_2xaem/a320arm6446736503650102
fvp_base_revc_2xaem/v9a/smparm644673800380087
versalnet_apu/amd_versalnet_apuarm6446736603660101
nrf9280pdk@0.2.0/nrf9280/cpuppr/xipriscv46727802780189
versal2_apu/amd_versal2_apu/smparm644663790379087
versalnet_apu/amd_versalnet_apu/smparm644663800380086
ch32v103evt/ch32v103riscv46626802680198
intel_adsp/ace20_lnl/simxtensa46634703470119
intel_adsp/ace30/ptl/simxtensa4663680368098
nsim/nsim_semarc46636203620104
versal_apu/versal_apu/smparm644653780378087
nsim/nsim_hs/hostlinkarc46335803580105
nsim/nsim_em11darc46235503550107
fvp_base_revc_2xaem/v8a/smp/nsarm644623730373089
nsim/nsim_hs/flash_xiparc46135903590102
nsim/nsim_sem/mpu_stack_guardarc46135703570104
qemu_xtensa/dc233c/mmuxtensa4603750375085
max32655evkit/max32655/rv32riscv45831403140144
intel_adsp/ace30/wcl/simxtensa4533590359094
mps3/corstone310/fvparm4333410341092
mps3/corstone310/an555arm4243340334090
stm32l562e_dk/stm32l562xx/ext_flash_apparm41527502750140
stm32h750b_dk/stm32h750xx/ext_flash_apparm3642680268096
mini_stm32h750/stm32h750xx/ext_flash_apparm3562650265091
fvp_baser_aemv8r/fvp_aemv8r_aarch32/smparm33121802180113
fvp_baser_aemv8r/fvp_aemv8r_aarch32arm32122002200101
fvp_baser_aemv8r/fvp_aemv8r_aarch64/smparm642992170217082
fvp_baser_aemv8r/fvp_aemv8r_aarch64arm642962200220076
mps2/an521/cpu0/nsarm2311710171060
adafruit_qt_py_esp32s3/esp32s3/appcpuxtensa2301550155075
adafruit_qt_py_esp32s3@psram/esp32s3/appcpuxtensa2301550155075
adafruit_feather_esp32@2/esp32/appcpuxtensa22911501150114
adafruit_feather_esp32s3/esp32s3/appcpuxtensa2291550155074
adafruit_feather_esp32s3_tft/esp32s3/appcpuxtensa2291550155074
adafruit_feather_esp32s3_tft_reverse/esp32s3/appcpuxtensa2291540154075
yd_esp32/esp32/appcpuxtensa22911401140115
can485dbv1/esp32/appcpuxtensa22811401140114
dnesp32s3b/esp32s3/appcpuxtensa2281530153075
doit_esp32_devkit_v1/esp32/appcpuxtensa22811401140114
eora_hub_900tb/esp32s3/appcpuxtensa2281530153075
esp32_cam/esp32/appcpuxtensa22811401140114
esp32_devkitc/esp32/appcpuxtensa22811401140114
esp32_ethernet_kit/esp32/appcpuxtensa22811401140114
esp32s3_box3/esp32s3/appcpuxtensa2281530153075
esp32s3_devkitc/esp32s3/appcpuxtensa2281530153075
esp32s3_eye/esp32s3/appcpuxtensa2281530153075
esp32s3_luatos_core/esp32s3/appcpu/usbxtensa2281530153075
esp32s3_luatos_core/esp32s3/appcpuxtensa2281530153075
esp32s3_matrix/esp32s3/appcpuxtensa2281530153075
esp32s3_touch_lcd_1_28/esp32s3/appcpuxtensa2281530153075
esp_threadbr/esp32s3/appcpuxtensa2281530153075
esp_wrover_kit/esp32/appcpuxtensa22811401140114
heltec_wifi_lora32_v2/esp32/appcpuxtensa22811401140114
heltec_wifi_lora32_v3/esp32s3/appcpuxtensa2281530153075
heltec_wireless_stick_lite_v3/esp32s3/appcpuxtensa2281530153075
heltec_wireless_tracker/esp32s3/appcpuxtensa2281530153075
inkplate_6color/esp32/appcpuxtensa22811401140114
kincony_kc868_a32/esp32/appcpuxtensa22811401140114
kincony_kc868_a8/esp32/appcpuxtensa22811401140114
lolin32_lite/esp32/appcpuxtensa22811401140114
m5stack_atom_lite/esp32/appcpuxtensa22811401140114
m5stack_atoms3/esp32s3/appcpuxtensa2281530153075
m5stack_atoms3_lite/esp32s3/appcpuxtensa2281530153075
m5stack_core2/esp32/appcpuxtensa22811401140114
m5stack_cores3/esp32s3/appcpuxtensa2281530153075
m5stack_fire/esp32/appcpuxtensa22811401140114
m5stack_paper_color/esp32s3/appcpuxtensa2281530153075
m5stack_stackchan/esp32s3/appcpuxtensa2281530153075
m5stack_stamps3/esp32s3/appcpuxtensa2281530153075
m5stack_sticks3/esp32s3/appcpuxtensa2281530153075
m5stickc_plus/esp32/appcpuxtensa22811401140114
matouch_mtro128g/esp32s3/appcpuxtensa2281530153075
odroid_go/esp32/appcpuxtensa22811401140114
olimex_esp32_evb/esp32/appcpuxtensa22811401140114
shrike_fi/esp32s3/appcpuxtensa2281530153075
tdongle_s3/esp32s3/appcpuxtensa2281540154074
ttgo_lora32/esp32/appcpuxtensa22811401140114
ttgo_t7v1_5/esp32/appcpuxtensa22811401140114
ttgo_t8s3/esp32s3/appcpuxtensa2281540154074
twatch_s3/esp32s3/appcpuxtensa2281540154074
udoo_key/esp32/appcpuxtensa22811401140114
walter/esp32s3/appcpuxtensa2281530153075
weact_esp32s3_b/esp32s3/appcpuxtensa2281530153075
weact_esp32s3_mini/esp32s3/appcpuxtensa2281530153075
rak3112/esp32s3/appcpuxtensa2271520152075
reterminal_e1001/esp32s3/appcpuxtensa2271530153074
reterminal_e1002/esp32s3/appcpuxtensa2271530153074
reterminal_e1003/esp32s3/appcpuxtensa2271530153074
t_deck@standard/esp32s3/appcpuxtensa2271530153074
xiao_esp32s3/esp32s3/appcpuxtensa2271530153074
ttgo_tbeam/esp32/appcpuxtensa22511201120113
esp32s3_geek/esp32s3/appcpuxtensa2191480148071
esp32s3_rlcd_4_2/esp32s3/appcpuxtensa2191480148071
uedx24320028e_wb_a/esp32s3/appcpuxtensa2191440144075
uedx32480035e_wb_a/esp32s3/appcpuxtensa2191480148071
qemu_x86_64/atom/nokptix861921640164028
qemu_x86/atom/nokptix861861540154032
qemu_x86/atom/nopaex861841520152032
qemu_x86/atom/virtx861841520152032
qemu_x86/atom/nommux861811210121060
qemu_x86_tiny/atomx861811470147034
cdns_swerv/s400/whisperriscv1701230123047
cdns_swerv/s420/64/whisperriscv1701340134036
cdns_swerv/s420/whisperriscv1701340134036
qemu_x86_lakemont/lakemontx861701410141029
qemu_hexagon/qemu_hexagon_virthexagon1691470147022
cdns_swerv/s400/pmp/whisperriscv1631350135028
imx8qm_mek/mimx8qm6/adspxtensa1621120112050
imx8qxp_mek/mimx8qx6/adspxtensa1621120112050
imx8ulp_evk/mimx8ud7/adspxtensa1621100110052
mimxrt595_evk/mimxrt595s/f1xtensa1621080108054
mimxrt700_evk@mx25um51345g/mimxrt798s/hifi1xtensa1621080108054
mimxrt700_evk@mx25um51345g/mimxrt798s/hifi4xtensa1621100110052
mt8365/mt8365/adspxtensa1621130113049
mt8186/mt8186/adspxtensa1611120112049
mt8188/mt8188/adspxtensa1611120112049
mt8195/mt8195/adspxtensa1611120112049
mt8196/mt8196/adspxtensa1611120112049
mimxrt685_evk/mimxrt685s/hifi4xtensa1571050105052
unit_testing/unit_testingunit122122012200
mps2/an521/cpu1arm5745045012
qemu_x86/atom/xipx86161101105
mps3/corstone300/fvp/nsarm131301300
mps3/corstone300/an552/nsarm101001000
mps3/corstone310/an555/nsarm101001000
mps3/corstone310/fvp/nsarm101001000
mps3/corstone300/an547/nsarm880800
qemu_cortex_a53/qemu_cortex_a53/xiparm64330300
qemu_riscv32_xip/fe310_g002riscv320201
nano_ch57x/ch570riscv320201
nano_ch57x/ch572riscv320201
nucleo_f334r8/stm32f334x8arm330300
nucleo_c031c6/stm32c031xxarm220200
nucleo_l053r8/stm32l053xxarm220200
stm32g0316_disco/stm32g031xxarm210101
nucleo_f030r8@1/stm32f030x8arm110100
nucleo_f030r8@2/stm32f030x8arm110100
nucleo_f303k8/stm32f303x8arm110100
nucleo_g031k8/stm32g031xxarm110100
nucleo_l031k6/stm32l031xxarm110100
nucleo_u031r8/stm32u031xxarm110100
stm32f0_disco/stm32f051x8arm110100
stm32vl_disco/stm32f100xbarm110100
ch32v006evt/ch32v006riscv100001
ch32v00x_core/ch32v006riscv100001
cy8cproto_040t/cy8c4046lqi_t452arm100001
cy8cproto_040t_auto/cy8c4046lqe_t1arm100001
elemrv_flask_h/elemrv_hriscv100001
fpb_ra0e1/r7fa0e1073cfjarm100001
frdm_ke16z/mke16z4arm100001
gd32c231c_eval/gd32c231arm100001
pic32cm_pl10_cnano/pic32cm6408pl10048arm100001